{"text_format":"1","workbook":"xlsx","n_sheets":4,"sheets":["公表名簿（管内）","公表名簿（県内建設)","公表名簿（県外建設)","等級(19-4月現在)"],"not_rendered":{"charts":0,"images":0,"macros":1,"external_links":0,"defined_names":4,"comments":0,"pivot_tables":0},"unopened":[],"bounds":{"document_bytes":16777216,"sheet_cells":100000,"rows_first":2000,"rows_last":500,"rows_between":2000,"halvings":0,"cell_chars":16384,"cell_head_chars":4096},"cells_cut":0,"cells_raw":0,"read":"whole","date_system":"1900"}

{"sheet":"公表名簿（管内）","index":0,"n_rows":44,"n_cols":38,"rows_kept":44,"cut":false,"hidden":false,"merged":[[0,6,0,11]]}
["八匝水道企業団建設工事等入札参加業者資格者名簿（管内）　",null,null,null,null,null,{"$f":"TODAY()","v":"2021-12-21"}]
["番号","区域","商号又は名称","所在地","代表者氏名","電話番号","ＦＡＸ","許可区分(土木)","土木一式","許可区分（建築）","建築一式","許可区分（電気）","電気","許可区分（管）","管","許可区分(ほ装)","ほ装","許可区分（塗装）","塗装","許可区分（防水）","防水","許可区分（機械器具）","機械器具設置","許可区分(電気)","電気通信","許可区分（水道施設）","水道施設","土木一式(等級)","建築一式(等級)","電気(等級)","管(等級)","ほ装(等級)","塗装(等級)","防水(等級)","機械器具設置(等級)","電気通信(等級)","水道施設(等級)","その他"]
[1,"管内","㈱畔蒜工務店","山武郡横芝光町木戸10110","畔蒜　義文","0479-84-1221","0479-84-0179","特定",1143,"特定",1239,"特定",901,"特定",884,"特定",1032,"特定",806,"特定",866,null,null,null,null,"特定",949,{"$f":"IF(NOT(ISBLANK(テーブル6[[#This Row],[土木一式]])),VLOOKUP(テーブル6[[#This Row],[土木一式]],土木[],2,TRUE), IF(NOT(ISBLANK(テーブル6[[#This Row],[許可区分(土木)]])),\"D\",\"-\"))","v":"A"},{"$f":"IF(NOT(ISBLANK(テーブル6[[#This Row],[建築一式]])),VLOOKUP(テーブル6[[#This Row],[建築一式]],建築[],2,TRUE), IF(NOT(ISBLANK(テーブル6[[#This Row],[許可区分（建築）]])),\"D\",\"-\"))","v":"A"},{"$f":"IF(NOT(ISBLANK(テーブル6[[#This Row],[電気]])),VLOOKUP(テーブル6[[#This Row],[電気]],電気[],2,TRUE), IF(NOT(ISBLANK(テーブル6[[#This Row],[許可区分（電気）]])),\"D\",\"-\"))","v":"A"},{"$f":"IF(NOT(ISBLANK(テーブル6[[#This Row],[管]])),VLOOKUP(テーブル6[[#This Row],[管]],管[],2,TRUE), IF(NOT(ISBLANK(テーブル6[[#This Row],[許可区分（管）]])),\"D\",\"-\"))","v":"A"},{"$f":"IF(NOT(ISBLANK(テーブル6[[#This Row],[ほ装]])),VLOOKUP(テーブル6[[#This Row],[ほ装]],ほ装[],2,TRUE), IF(NOT(ISBLANK(テーブル6[[#This Row],[許可区分(ほ装)]])),\"D\",\"-\"))","v":"A"},{"$f":"IF(NOT(ISBLANK(テーブル6[[#This Row],[塗装]])),VLOOKUP(テーブル6[[#This Row],[塗装]],塗装[],2,TRUE), IF(NOT(ISBLANK(テーブル6[[#This Row],[許可区分（塗装）]])),\"D\",\"-\"))","v":"A"},{"$f":"IF(NOT(ISBLANK(テーブル6[[#This Row],[防水]])),VLOOKUP(テーブル6[[#This Row],[防水]],塗装[],2,TRUE), IF(NOT(ISBLANK(テーブル6[[#This Row],[許可区分（防水）]])),\"D\",\"-\"))","v":"A"},{"$f":"IF(NOT(ISBLANK(テーブル6[[#This Row],[機械器具設置]])),VLOOKUP(テーブル6[[#This Row],[機械器具設置]],塗装[],2,TRUE), IF(NOT(ISBLANK(テーブル6[[#This Row],[許可区分（機械器具）]])),\"D\",\"-\"))","v":"-"},{"$f":"IF(NOT(ISBLANK(テーブル6[[#This Row],[電気通信]])),VLOOKUP(テーブル6[[#This Row],[電気通信]],電気[],2,TRUE), IF(NOT(ISBLANK(テーブル6[[#This Row],[許可区分(電気)]])),\"D\",\"-\"))","v":"-"},{"$f":"IF(NOT(ISBLANK(テーブル6[[#This Row],[水道施設]])),VLOOKUP(テーブル6[[#This Row],[水道施設]],水道[],2,TRUE), IF(NOT(ISBLANK(テーブル6[[#This Row],[許可区分（水道施設）]])),\"D\",\"-\"))","v":"A"}]
[2,"管内","小原建設㈱","匝瑳市八日市場ハ315","小原　久幸","0479-73-2121","0479-72-1088","特定",961,null,null,null,null,null,null,"特定",856,null,null,null,null,null,null,null,null,"一般",804,{"$f":"IF(NOT(ISBLANK(テーブル6[[#This Row],[土木一式]])),VLOOKUP(テーブル6[[#This Row],[土木一式]],土木[],2,TRUE), IF(NOT(ISBLANK(テーブル6[[#This Row],[許可区分(土木)]])),\"D\",\"-\"))","v":"A"},{"$f":"IF(NOT(ISBLANK(テーブル6[[#This Row],[建築一式]])),VLOOKUP(テーブル6[[#This Row],[建築一式]],建築[],2,TRUE), IF(NOT(ISBLANK(テーブル6[[#This Row],[許可区分（建築）]])),\"D\",\"-\"))","v":"-"},{"$f":"IF(NOT(ISBLANK(テーブル6[[#This Row],[電気]])),VLOOKUP(テーブル6[[#This Row],[電気]],電気[],2,TRUE), IF(NOT(ISBLANK(テーブル6[[#This Row],[許可区分（電気）]])),\"D\",\"-\"))","v":"-"},{"$f":"IF(NOT(ISBLANK(テーブル6[[#This Row],[管]])),VLOOKUP(テーブル6[[#This Row],[管]],管[],2,TRUE), IF(NOT(ISBLANK(テーブル6[[#This Row],[許可区分（管）]])),\"D\",\"-\"))","v":"-"},{"$f":"IF(NOT(ISBLANK(テーブル6[[#This Row],[ほ装]])),VLOOKUP(テーブル6[[#This Row],[ほ装]],ほ装[],2,TRUE), IF(NOT(ISBLANK(テーブル6[[#This Row],[許可区分(ほ装)]])),\"D\",\"-\"))","v":"A"},{"$f":"IF(NOT(ISBLANK(テーブル6[[#This Row],[塗装]])),VLOOKUP(テーブル6[[#This Row],[塗装]],塗装[],2,TRUE), IF(NOT(ISBLANK(テーブル6[[#This Row],[許可区分（塗装）]])),\"D\",\"-\"))","v":"-"},{"$f":"IF(NOT(ISBLANK(テーブル6[[#This Row],[防水]])),VLOOKUP(テーブル6[[#This Row],[防水]],塗装[],2,TRUE), IF(NOT(ISBLANK(テーブル6[[#This Row],[許可区分（防水）]])),\"D\",\"-\"))","v":"-"},{"$f":"IF(NOT(ISBLANK(テーブル6[[#This Row],[機械器具設置]])),VLOOKUP(テーブル6[[#This Row],[機械器具設置]],塗装[],2,TRUE), IF(NOT(ISBLANK(テーブル6[[#This Row],[許可区分（機械器具）]])),\"D\",\"-\"))","v":"-"},{"$f":"IF(NOT(ISBLANK(テーブル6[[#This Row],[電気通信]])),VLOOKUP(テーブル6[[#This Row],[電気通信]],電気[],2,TRUE), IF(NOT(ISBLANK(テーブル6[[#This Row],[許可区分(電気)]])),\"D\",\"-\"))","v":"-"},{"$f":"IF(NOT(ISBLANK(テーブル6[[#This Row],[水道施設]])),VLOOKUP(テーブル6[[#This Row],[水道施設]],水道[],2,TRUE), IF(NOT(ISBLANK(テーブル6[[#This Row],[許可区分（水道施設）]])),\"D\",\"-\"))","v":"A"}]
[3,"管内","㈱丸二","匝瑳市八日市場ハ320-1","小原　靜子","0479-72-0833","0479-72-1088","一般",610,null,null,null,null,"一般",631,"一般",581,null,null,null,null,null,null,null,null,"一般",581,{"$f":"IF(NOT(ISBLANK(テーブル6[[#This Row],[土木一式]])),VLOOKUP(テーブル6[[#This Row],[土木一式]],土木[],2,TRUE), IF(NOT(ISBLANK(テーブル6[[#This Row],[許可区分(土木)]])),\"D\",\"-\"))","v":"C"},{"$f":"IF(NOT(ISBLANK(テーブル6[[#This Row],[建築一式]])),VLOOKUP(テーブル6[[#This Row],[建築一式]],建築[],2,TRUE), IF(NOT(ISBLANK(テーブル6[[#This Row],[許可区分（建築）]])),\"D\",\"-\"))","v":"-"},{"$f":"IF(NOT(ISBLANK(テーブル6[[#This Row],[電気]])),VLOOKUP(テーブル6[[#This Row],[電気]],電気[],2,TRUE), IF(NOT(ISBLANK(テーブル6[[#This Row],[許可区分（電気）]])),\"D\",\"-\"))","v":"-"},{"$f":"IF(NOT(ISBLANK(テーブル6[[#This Row],[管]])),VLOOKUP(テーブル6[[#This Row],[管]],管[],2,TRUE), IF(NOT(ISBLANK(テーブル6[[#This Row],[許可区分（管）]])),\"D\",\"-\"))","v":"B"},{"$f":"IF(NOT(ISBLANK(テーブル6[[#This Row],[ほ装]])),VLOOKUP(テーブル6[[#This Row],[ほ装]],ほ装[],2,TRUE), IF(NOT(ISBLANK(テーブル6[[#This Row],[許可区分(ほ装)]])),\"D\",\"-\"))","v":"C"},{"$f":"IF(NOT(ISBLANK(テーブル6[[#This Row],[塗装]])),VLOOKUP(テーブル6[[#This Row],[塗装]],塗装[],2,TRUE), IF(NOT(ISBLANK(テーブル6[[#This Row],[許可区分（塗装）]])),\"D\",\"-\"))","v":"-"},{"$f":"IF(NOT(ISBLANK(テーブル6[[#This Row],[防水]])),VLOOKUP(テーブル6[[#This Row],[防水]],塗装[],2,TRUE), IF(NOT(ISBLANK(テーブル6[[#This Row],[許可区分（防水）]])),\"D\",\"-\"))","v":"-"},{"$f":"IF(NOT(ISBLANK(テーブル6[[#This Row],[機械器具設置]])),VLOOKUP(テーブル6[[#This Row],[機械器具設置]],塗装[],2,TRUE), IF(NOT(ISBLANK(テーブル6[[#This Row],[許可区分（機械器具）]])),\"D\",\"-\"))","v":"-"},{"$f":"IF(NOT(ISBLANK(テーブル6[[#This Row],[電気通信]])),VLOOKUP(テーブル6[[#This Row],[電気通信]],電気[],2,TRUE), IF(NOT(ISBLANK(テーブル6[[#This Row],[許可区分(電気)]])),\"D\",\"-\"))","v":"-"},{"$f":"IF(NOT(ISBLANK(テーブル6[[#This Row],[水道施設]])),VLOOKUP(テーブル6[[#This Row],[水道施設]],水道[],2,TRUE), IF(NOT(ISBLANK(テーブル6[[#This Row],[許可区分（水道施設）]])),\"D\",\"-\"))","v":"D"}]
[4,"管内","鈴久建設㈱","匝瑳市八日市場イ432-1","鈴木　英人","0479-72-3077","0479-72-3079","特定",857,"特定",936,null,null,null,null,"特定",748,"特定",739,"特定",718,null,null,null,null,null,null,{"$f":"IF(NOT(ISBLANK(テーブル6[[#This Row],[土木一式]])),VLOOKUP(テーブル6[[#This Row],[土木一式]],土木[],2,TRUE), IF(NOT(ISBLANK(テーブル6[[#This Row],[許可区分(土木)]])),\"D\",\"-\"))","v":"A"},{"$f":"IF(NOT(ISBLANK(テーブル6[[#This Row],[建築一式]])),VLOOKUP(テーブル6[[#This Row],[建築一式]],建築[],2,TRUE), IF(NOT(ISBLANK(テーブル6[[#This Row],[許可区分（建築）]])),\"D\",\"-\"))","v":"A"},{"$f":"IF(NOT(ISBLANK(テーブル6[[#This Row],[電気]])),VLOOKUP(テーブル6[[#This Row],[電気]],電気[],2,TRUE), IF(NOT(ISBLANK(テーブル6[[#This Row],[許可区分（電気）]])),\"D\",\"-\"))","v":"-"},{"$f":"IF(NOT(ISBLANK(テーブル6[[#This Row],[管]])),VLOOKUP(テーブル6[[#This Row],[管]],管[],2,TRUE), IF(NOT(ISBLANK(テーブル6[[#This Row],[許可区分（管）]])),\"D\",\"-\"))","v":"-"},{"$f":"IF(NOT(ISBLANK(テーブル6[[#This Row],[ほ装]])),VLOOKUP(テーブル6[[#This Row],[ほ装]],ほ装[],2,TRUE), IF(NOT(ISBLANK(テーブル6[[#This Row],[許可区分(ほ装)]])),\"D\",\"-\"))","v":"A"},{"$f":"IF(NOT(ISBLANK(テーブル6[[#This Row],[塗装]])),VLOOKUP(テーブル6[[#This Row],[塗装]],塗装[],2,TRUE), IF(NOT(ISBLANK(テーブル6[[#This Row],[許可区分（塗装）]])),\"D\",\"-\"))","v":"B"},{"$f":"IF(NOT(ISBLANK(テーブル6[[#This Row],[防水]])),VLOOKUP(テーブル6[[#This Row],[防水]],塗装[],2,TRUE), IF(NOT(ISBLANK(テーブル6[[#This Row],[許可区分（防水）]])),\"D\",\"-\"))","v":"B"},{"$f":"IF(NOT(ISBLANK(テーブル6[[#This Row],[機械器具設置]])),VLOOKUP(テーブル6[[#This Row],[機械器具設置]],塗装[],2,TRUE), IF(NOT(ISBLANK(テーブル6[[#This Row],[許可区分（機械器具）]])),\"D\",\"-\"))","v":"-"},{"$f":"IF(NOT(ISBLANK(テーブル6[[#This Row],[電気通信]])),VLOOKUP(テーブル6[[#This Row],[電気通信]],電気[],2,TRUE), IF(NOT(ISBLANK(テーブル6[[#This Row],[許可区分(電気)]])),\"D\",\"-\"))","v":"-"},{"$f":"IF(NOT(ISBLANK(テーブル6[[#This Row],[水道施設]])),VLOOKUP(テーブル6[[#This Row],[水道施設]],水道[],2,TRUE), IF(NOT(ISBLANK(テーブル6[[#This Row],[許可区分（水道施設）]])),\"D\",\"-\"))","v":"-"}]
[5,"管内","鵜沢建設㈱　匝瑳支店","匝瑳市上谷中2167-1","鵜沢　和広","0479-72-1123","0479-73-6766","特定",696,"特定",1163,null,null,"特定",705,"特定",698,"特定",719,"特定",720,null,null,null,null,null,null,{"$f":"IF(NOT(ISBLANK(テーブル6[[#This Row],[土木一式]])),VLOOKUP(テーブル6[[#This Row],[土木一式]],土木[],2,TRUE), IF(NOT(ISBLANK(テーブル6[[#This Row],[許可区分(土木)]])),\"D\",\"-\"))","v":"B"},{"$f":"IF(NOT(ISBLANK(テーブル6[[#This Row],[建築一式]])),VLOOKUP(テーブル6[[#This Row],[建築一式]],建築[],2,TRUE), IF(NOT(ISBLANK(テーブル6[[#This Row],[許可区分（建築）]])),\"D\",\"-\"))","v":"A"},{"$f":"IF(NOT(ISBLANK(テーブル6[[#This Row],[電気]])),VLOOKUP(テーブル6[[#This Row],[電気]],電気[],2,TRUE), IF(NOT(ISBLANK(テーブル6[[#This Row],[許可区分（電気）]])),\"D\",\"-\"))","v":"-"},{"$f":"IF(NOT(ISBLANK(テーブル6[[#This Row],[管]])),VLOOKUP(テーブル6[[#This Row],[管]],管[],2,TRUE), IF(NOT(ISBLANK(テーブル6[[#This Row],[許可区分（管）]])),\"D\",\"-\"))","v":"A"},{"$f":"IF(NOT(ISBLANK(テーブル6[[#This Row],[ほ装]])),VLOOKUP(テーブル6[[#This Row],[ほ装]],ほ装[],2,TRUE), IF(NOT(ISBLANK(テーブル6[[#This Row],[許可区分(ほ装)]])),\"D\",\"-\"))","v":"B"},{"$f":"IF(NOT(ISBLANK(テーブル6[[#This Row],[塗装]])),VLOOKUP(テーブル6[[#This Row],[塗装]],塗装[],2,TRUE), IF(NOT(ISBLANK(テーブル6[[#This Row],[許可区分（塗装）]])),\"D\",\"-\"))","v":"B"},{"$f":"IF(NOT(ISBLANK(テーブル6[[#This Row],[防水]])),VLOOKUP(テーブル6[[#This Row],[防水]],塗装[],2,TRUE), IF(NOT(ISBLANK(テーブル6[[#This Row],[許可区分（防水）]])),\"D\",\"-\"))","v":"B"},{"$f":"IF(NOT(ISBLANK(テーブル6[[#This Row],[機械器具設置]])),VLOOKUP(テーブル6[[#This Row],[機械器具設置]],塗装[],2,TRUE), IF(NOT(ISBLANK(テーブル6[[#This Row],[許可区分（機械器具）]])),\"D\",\"-\"))","v":"-"},{"$f":"IF(NOT(ISBLANK(テーブル6[[#This Row],[電気通信]])),VLOOKUP(テーブル6[[#This Row],[電気通信]],電気[],2,TRUE), IF(NOT(ISBLANK(テーブル6[[#This Row],[許可区分(電気)]])),\"D\",\"-\"))","v":"-"},{"$f":"IF(NOT(ISBLANK(テーブル6[[#This Row],[水道施設]])),VLOOKUP(テーブル6[[#This Row],[水道施設]],水道[],2,TRUE), IF(NOT(ISBLANK(テーブル6[[#This Row],[許可区分（水道施設）]])),\"D\",\"-\"))","v":"-"}]
[6,"管内","㈱ニューテック康和　千葉支店","匝瑳市野手958-1","古川　錠二","0479-67-3211","0479-67-3215","特定",1066,null,null,null,null,null,null,"特定",1072,"特定",703,null,null,null,null,null,null,"特定",766,{"$f":"IF(NOT(ISBLANK(テーブル6[[#This Row],[土木一式]])),VLOOKUP(テーブル6[[#This Row],[土木一式]],土木[],2,TRUE), IF(NOT(ISBLANK(テーブル6[[#This Row],[許可区分(土木)]])),\"D\",\"-\"))","v":"A"},{"$f":"IF(NOT(ISBLANK(テーブル6[[#This Row],[建築一式]])),VLOOKUP(テーブル6[[#This Row],[建築一式]],建築[],2,TRUE), IF(NOT(ISBLANK(テーブル6[[#This Row],[許可区分（建築）]])),\"D\",\"-\"))","v":"-"},{"$f":"IF(NOT(ISBLANK(テーブル6[[#This Row],[電気]])),VLOOKUP(テーブル6[[#This Row],[電気]],電気[],2,TRUE), IF(NOT(ISBLANK(テーブル6[[#This Row],[許可区分（電気）]])),\"D\",\"-\"))","v":"-"},{"$f":"IF(NOT(ISBLANK(テーブル6[[#This Row],[管]])),VLOOKUP(テーブル6[[#This Row],[管]],管[],2,TRUE), IF(NOT(ISBLANK(テーブル6[[#This Row],[許可区分（管）]])),\"D\",\"-\"))","v":"-"},{"$f":"IF(NOT(ISBLANK(テーブル6[[#This Row],[ほ装]])),VLOOKUP(テーブル6[[#This Row],[ほ装]],ほ装[],2,TRUE), IF(NOT(ISBLANK(テーブル6[[#This Row],[許可区分(ほ装)]])),\"D\",\"-\"))","v":"A"},{"$f":"IF(NOT(ISBLANK(テーブル6[[#This Row],[塗装]])),VLOOKUP(テーブル6[[#This Row],[塗装]],塗装[],2,TRUE), IF(NOT(ISBLANK(テーブル6[[#This Row],[許可区分（塗装）]])),\"D\",\"-\"))","v":"B"},{"$f":"IF(NOT(ISBLANK(テーブル6[[#This Row],[防水]])),VLOOKUP(テーブル6[[#This Row],[防水]],塗装[],2,TRUE), IF(NOT(ISBLANK(テーブル6[[#This Row],[許可区分（防水）]])),\"D\",\"-\"))","v":"-"},{"$f":"IF(NOT(ISBLANK(テーブル6[[#This Row],[機械器具設置]])),VLOOKUP(テーブル6[[#This Row],[機械器具設置]],塗装[],2,TRUE), IF(NOT(ISBLANK(テーブル6[[#This Row],[許可区分（機械器具）]])),\"D\",\"-\"))","v":"-"},{"$f":"IF(NOT(ISBLANK(テーブル6[[#This Row],[電気通信]])),VLOOKUP(テーブル6[[#This Row],[電気通信]],電気[],2,TRUE), IF(NOT(ISBLANK(テーブル6[[#This Row],[許可区分(電気)]])),\"D\",\"-\"))","v":"-"},{"$f":"IF(NOT(ISBLANK(テーブル6[[#This Row],[水道施設]])),VLOOKUP(テーブル6[[#This Row],[水道施設]],水道[],2,TRUE), IF(NOT(ISBLANK(テーブル6[[#This Row],[許可区分（水道施設）]])),\"D\",\"-\"))","v":"B"}]
[7,"管内","三ツ木建設㈱","匝瑳市横須賀118","森　隆一","0479-72-0433","0479-73-2433","特定",847,null,null,null,null,null,null,"特定",795,null,null,null,null,null,null,null,null,null,null,{"$f":"IF(NOT(ISBLANK(テーブル6[[#This Row],[土木一式]])),VLOOKUP(テーブル6[[#This Row],[土木一式]],土木[],2,TRUE), IF(NOT(ISBLANK(テーブル6[[#This Row],[許可区分(土木)]])),\"D\",\"-\"))","v":"A"},{"$f":"IF(NOT(ISBLANK(テーブル6[[#This Row],[建築一式]])),VLOOKUP(テーブル6[[#This Row],[建築一式]],建築[],2,TRUE), IF(NOT(ISBLANK(テーブル6[[#This Row],[許可区分（建築）]])),\"D\",\"-\"))","v":"-"},{"$f":"IF(NOT(ISBLANK(テーブル6[[#This Row],[電気]])),VLOOKUP(テーブル6[[#This Row],[電気]],電気[],2,TRUE), IF(NOT(ISBLANK(テーブル6[[#This Row],[許可区分（電気）]])),\"D\",\"-\"))","v":"-"},{"$f":"IF(NOT(ISBLANK(テーブル6[[#This Row],[管]])),VLOOKUP(テーブル6[[#This Row],[管]],管[],2,TRUE), IF(NOT(ISBLANK(テーブル6[[#This Row],[許可区分（管）]])),\"D\",\"-\"))","v":"-"},{"$f":"IF(NOT(ISBLANK(テーブル6[[#This Row],[ほ装]])),VLOOKUP(テーブル6[[#This Row],[ほ装]],ほ装[],2,TRUE), IF(NOT(ISBLANK(テーブル6[[#This Row],[許可区分(ほ装)]])),\"D\",\"-\"))","v":"A"},{"$f":"IF(NOT(ISBLANK(テーブル6[[#This Row],[塗装]])),VLOOKUP(テーブル6[[#This Row],[塗装]],塗装[],2,TRUE), IF(NOT(ISBLANK(テーブル6[[#This Row],[許可区分（塗装）]])),\"D\",\"-\"))","v":"-"},{"$f":"IF(NOT(ISBLANK(テーブル6[[#This Row],[防水]])),VLOOKUP(テーブル6[[#This Row],[防水]],塗装[],2,TRUE), IF(NOT(ISBLANK(テーブル6[[#This Row],[許可区分（防水）]])),\"D\",\"-\"))","v":"-"},{"$f":"IF(NOT(ISBLANK(テーブル6[[#This Row],[機械器具設置]])),VLOOKUP(テーブル6[[#This Row],[機械器具設置]],塗装[],2,TRUE), IF(NOT(ISBLANK(テーブル6[[#This Row],[許可区分（機械器具）]])),\"D\",\"-\"))","v":"-"},{"$f":"IF(NOT(ISBLANK(テーブル6[[#This Row],[電気通信]])),VLOOKUP(テーブル6[[#This Row],[電気通信]],電気[],2,TRUE), IF(NOT(ISBLANK(テーブル6[[#This Row],[許可区分(電気)]])),\"D\",\"-\"))","v":"-"},{"$f":"IF(NOT(ISBLANK(テーブル6[[#This Row],[水道施設]])),VLOOKUP(テーブル6[[#This Row],[水道施設]],水道[],2,TRUE), IF(NOT(ISBLANK(テーブル6[[#This Row],[許可区分（水道施設）]])),\"D\",\"-\"))","v":"-"}]
[8,"管内","㈱三橋土木","匝瑳市吉田1525","三橋　宏","0479-79-0321","0479-73-1626","一般",798,null,null,null,null,null,null,"一般",764,null,null,null,null,null,null,null,null,null,null,{"$f":"IF(NOT(ISBLANK(テーブル6[[#This Row],[土木一式]])),VLOOKUP(テーブル6[[#This Row],[土木一式]],土木[],2,TRUE), IF(NOT(ISBLANK(テーブル6[[#This Row],[許可区分(土木)]])),\"D\",\"-\"))","v":"A"},{"$f":"IF(NOT(ISBLANK(テーブル6[[#This Row],[建築一式]])),VLOOKUP(テーブル6[[#This Row],[建築一式]],建築[],2,TRUE), IF(NOT(ISBLANK(テーブル6[[#This Row],[許可区分（建築）]])),\"D\",\"-\"))","v":"-"},{"$f":"IF(NOT(ISBLANK(テーブル6[[#This Row],[電気]])),VLOOKUP(テーブル6[[#This Row],[電気]],電気[],2,TRUE), IF(NOT(ISBLANK(テーブル6[[#This Row],[許可区分（電気）]])),\"D\",\"-\"))","v":"-"},{"$f":"IF(NOT(ISBLANK(テーブル6[[#This Row],[管]])),VLOOKUP(テーブル6[[#This Row],[管]],管[],2,TRUE), IF(NOT(ISBLANK(テーブル6[[#This Row],[許可区分（管）]])),\"D\",\"-\"))","v":"-"},{"$f":"IF(NOT(ISBLANK(テーブル6[[#This Row],[ほ装]])),VLOOKUP(テーブル6[[#This Row],[ほ装]],ほ装[],2,TRUE), IF(NOT(ISBLANK(テーブル6[[#This Row],[許可区分(ほ装)]])),\"D\",\"-\"))","v":"A"},{"$f":"IF(NOT(ISBLANK(テーブル6[[#This Row],[塗装]])),VLOOKUP(テーブル6[[#This Row],[塗装]],塗装[],2,TRUE), IF(NOT(ISBLANK(テーブル6[[#This Row],[許可区分（塗装）]])),\"D\",\"-\"))","v":"-"},{"$f":"IF(NOT(ISBLANK(テーブル6[[#This Row],[防水]])),VLOOKUP(テーブル6[[#This Row],[防水]],塗装[],2,TRUE), IF(NOT(ISBLANK(テーブル6[[#This Row],[許可区分（防水）]])),\"D\",\"-\"))","v":"-"},{"$f":"IF(NOT(ISBLANK(テーブル6[[#This Row],[機械器具設置]])),VLOOKUP(テーブル6[[#This Row],[機械器具設置]],塗装[],2,TRUE), IF(NOT(ISBLANK(テーブル6[[#This Row],[許可区分（機械器具）]])),\"D\",\"-\"))","v":"-"},{"$f":"IF(NOT(ISBLANK(テーブル6[[#This Row],[電気通信]])),VLOOKUP(テーブル6[[#This Row],[電気通信]],電気[],2,TRUE), IF(NOT(ISBLANK(テーブル6[[#This Row],[許可区分(電気)]])),\"D\",\"-\"))","v":"-"},{"$f":"IF(NOT(ISBLANK(テーブル6[[#This Row],[水道施設]])),VLOOKUP(テーブル6[[#This Row],[水道施設]],水道[],2,TRUE), IF(NOT(ISBLANK(テーブル6[[#This Row],[許可区分（水道施設）]])),\"D\",\"-\"))","v":"-"}]
[9,"管内","豊和造園土木㈱","匝瑳市大寺574-1","桑田　克己","0479-74-0340","0479-74-1705","一般",500,null,null,null,null,null,null,"一般",487,null,null,null,null,null,null,null,null,null,null,{"$f":"IF(NOT(ISBLANK(テーブル6[[#This Row],[土木一式]])),VLOOKUP(テーブル6[[#This Row],[土木一式]],土木[],2,TRUE), IF(NOT(ISBLANK(テーブル6[[#This Row],[許可区分(土木)]])),\"D\",\"-\"))","v":"D"},{"$f":"IF(NOT(ISBLANK(テーブル6[[#This Row],[建築一式]])),VLOOKUP(テーブル6[[#This Row],[建築一式]],建築[],2,TRUE), IF(NOT(ISBLANK(テーブル6[[#This Row],[許可区分（建築）]])),\"D\",\"-\"))","v":"-"},{"$f":"IF(NOT(ISBLANK(テーブル6[[#This Row],[電気]])),VLOOKUP(テーブル6[[#This Row],[電気]],電気[],2,TRUE), IF(NOT(ISBLANK(テーブル6[[#This Row],[許可区分（電気）]])),\"D\",\"-\"))","v":"-"},{"$f":"IF(NOT(ISBLANK(テーブル6[[#This Row],[管]])),VLOOKUP(テーブル6[[#This Row],[管]],管[],2,TRUE), IF(NOT(ISBLANK(テーブル6[[#This Row],[許可区分（管）]])),\"D\",\"-\"))","v":"-"},{"$f":"IF(NOT(ISBLANK(テーブル6[[#This Row],[ほ装]])),VLOOKUP(テーブル6[[#This Row],[ほ装]],ほ装[],2,TRUE), IF(NOT(ISBLANK(テーブル6[[#This Row],[許可区分(ほ装)]])),\"D\",\"-\"))","v":"D"},{"$f":"IF(NOT(ISBLANK(テーブル6[[#This Row],[塗装]])),VLOOKUP(テーブル6[[#This Row],[塗装]],塗装[],2,TRUE), IF(NOT(ISBLANK(テーブル6[[#This Row],[許可区分（塗装）]])),\"D\",\"-\"))","v":"-"},{"$f":"IF(NOT(ISBLANK(テーブル6[[#This Row],[防水]])),VLOOKUP(テーブル6[[#This Row],[防水]],塗装[],2,TRUE), IF(NOT(ISBLANK(テーブル6[[#This Row],[許可区分（防水）]])),\"D\",\"-\"))","v":"-"},{"$f":"IF(NOT(ISBLANK(テーブル6[[#This Row],[機械器具設置]])),VLOOKUP(テーブル6[[#This Row],[機械器具設置]],塗装[],2,TRUE), IF(NOT(ISBLANK(テーブル6[[#This Row],[許可区分（機械器具）]])),\"D\",\"-\"))","v":"-"},{"$f":"IF(NOT(ISBLANK(テーブル6[[#This Row],[電気通信]])),VLOOKUP(テーブル6[[#This Row],[電気通信]],電気[],2,TRUE), IF(NOT(ISBLANK(テーブル6[[#This Row],[許可区分(電気)]])),\"D\",\"-\"))","v":"-"},{"$f":"IF(NOT(ISBLANK(テーブル6[[#This Row],[水道施設]])),VLOOKUP(テーブル6[[#This Row],[水道施設]],水道[],2,TRUE), IF(NOT(ISBLANK(テーブル6[[#This Row],[許可区分（水道施設）]])),\"D\",\"-\"))","v":"-"}]
[10,"管内","ダイシン工業㈱","山武郡横芝光町宮川7436","大木　要輔","0479-84-1726","0479-84-0806","一般",551,null,null,null,null,"一般",612,null,null,null,null,null,null,null,null,null,null,null,null,{"$f":"IF(NOT(ISBLANK(テーブル6[[#This Row],[土木一式]])),VLOOKUP(テーブル6[[#This Row],[土木一式]],土木[],2,TRUE), IF(NOT(ISBLANK(テーブル6[[#This Row],[許可区分(土木)]])),\"D\",\"-\"))","v":"C"},{"$f":"IF(NOT(ISBLANK(テーブル6[[#This Row],[建築一式]])),VLOOKUP(テーブル6[[#This Row],[建築一式]],建築[],2,TRUE), IF(NOT(ISBLANK(テーブル6[[#This Row],[許可区分（建築）]])),\"D\",\"-\"))","v":"-"},{"$f":"IF(NOT(ISBLANK(テーブル6[[#This Row],[電気]])),VLOOKUP(テーブル6[[#This Row],[電気]],電気[],2,TRUE), IF(NOT(ISBLANK(テーブル6[[#This Row],[許可区分（電気）]])),\"D\",\"-\"))","v":"-"},{"$f":"IF(NOT(ISBLANK(テーブル6[[#This Row],[管]])),VLOOKUP(テーブル6[[#This Row],[管]],管[],2,TRUE), IF(NOT(ISBLANK(テーブル6[[#This Row],[許可区分（管）]])),\"D\",\"-\"))","v":"B"},{"$f":"IF(NOT(ISBLANK(テーブル6[[#This Row],[ほ装]])),VLOOKUP(テーブル6[[#This Row],[ほ装]],ほ装[],2,TRUE), IF(NOT(ISBLANK(テーブル6[[#This Row],[許可区分(ほ装)]])),\"D\",\"-\"))","v":"-"},{"$f":"IF(NOT(ISBLANK(テーブル6[[#This Row],[塗装]])),VLOOKUP(テーブル6[[#This Row],[塗装]],塗装[],2,TRUE), IF(NOT(ISBLANK(テーブル6[[#This Row],[許可区分（塗装）]])),\"D\",\"-\"))","v":"-"},{"$f":"IF(NOT(ISBLANK(テーブル6[[#This Row],[防水]])),VLOOKUP(テーブル6[[#This Row],[防水]],塗装[],2,TRUE), IF(NOT(ISBLANK(テーブル6[[#This Row],[許可区分（防水）]])),\"D\",\"-\"))","v":"-"},{"$f":"IF(NOT(ISBLANK(テーブル6[[#This Row],[機械器具設置]])),VLOOKUP(テーブル6[[#This Row],[機械器具設置]],塗装[],2,TRUE), IF(NOT(ISBLANK(テーブル6[[#This Row],[許可区分（機械器具）]])),\"D\",\"-\"))","v":"-"},{"$f":"IF(NOT(ISBLANK(テーブル6[[#This Row],[電気通信]])),VLOOKUP(テーブル6[[#This Row],[電気通信]],電気[],2,TRUE), IF(NOT(ISBLANK(テーブル6[[#This Row],[許可区分(電気)]])),\"D\",\"-\"))","v":"-"},{"$f":"IF(NOT(ISBLANK(テーブル6[[#This Row],[水道施設]])),VLOOKUP(テーブル6[[#This Row],[水道施設]],水道[],2,TRUE), IF(NOT(ISBLANK(テーブル6[[#This Row],[許可区分（水道施設）]])),\"D\",\"-\"))","v":"-"}]
[11,"管内","東栄㈱","匝瑳市八日市場ロ240-1","大塚　康広","0479-73-1431","0479-79-0708","一般",430,null,null,null,null,"一般",529,null,null,null,null,null,null,null,null,null,null,null,null,{"$f":"IF(NOT(ISBLANK(テーブル6[[#This Row],[土木一式]])),VLOOKUP(テーブル6[[#This Row],[土木一式]],土木[],2,TRUE), IF(NOT(ISBLANK(テーブル6[[#This Row],[許可区分(土木)]])),\"D\",\"-\"))","v":"D"},{"$f":"IF(NOT(ISBLANK(テーブル6[[#This Row],[建築一式]])),VLOOKUP(テーブル6[[#This Row],[建築一式]],建築[],2,TRUE), IF(NOT(ISBLANK(テーブル6[[#This Row],[許可区分（建築）]])),\"D\",\"-\"))","v":"-"},{"$f":"IF(NOT(ISBLANK(テーブル6[[#This Row],[電気]])),VLOOKUP(テーブル6[[#This Row],[電気]],電気[],2,TRUE), IF(NOT(ISBLANK(テーブル6[[#This Row],[許可区分（電気）]])),\"D\",\"-\"))","v":"-"},{"$f":"IF(NOT(ISBLANK(テーブル6[[#This Row],[管]])),VLOOKUP(テーブル6[[#This Row],[管]],管[],2,TRUE), IF(NOT(ISBLANK(テーブル6[[#This Row],[許可区分（管）]])),\"D\",\"-\"))","v":"C"},{"$f":"IF(NOT(ISBLANK(テーブル6[[#This Row],[ほ装]])),VLOOKUP(テーブル6[[#This Row],[ほ装]],ほ装[],2,TRUE), IF(NOT(ISBLANK(テーブル6[[#This Row],[許可区分(ほ装)]])),\"D\",\"-\"))","v":"-"},{"$f":"IF(NOT(ISBLANK(テーブル6[[#This Row],[塗装]])),VLOOKUP(テーブル6[[#This Row],[塗装]],塗装[],2,TRUE), IF(NOT(ISBLANK(テーブル6[[#This Row],[許可区分（塗装）]])),\"D\",\"-\"))","v":"-"},{"$f":"IF(NOT(ISBLANK(テーブル6[[#This Row],[防水]])),VLOOKUP(テーブル6[[#This Row],[防水]],塗装[],2,TRUE), IF(NOT(ISBLANK(テーブル6[[#This Row],[許可区分（防水）]])),\"D\",\"-\"))","v":"-"},{"$f":"IF(NOT(ISBLANK(テーブル6[[#This Row],[機械器具設置]])),VLOOKUP(テーブル6[[#This Row],[機械器具設置]],塗装[],2,TRUE), IF(NOT(ISBLANK(テーブル6[[#This Row],[許可区分（機械器具）]])),\"D\",\"-\"))","v":"-"},{"$f":"IF(NOT(ISBLANK(テーブル6[[#This Row],[電気通信]])),VLOOKUP(テーブル6[[#This Row],[電気通信]],電気[],2,TRUE), IF(NOT(ISBLANK(テーブル6[[#This Row],[許可区分(電気)]])),\"D\",\"-\"))","v":"-"},{"$f":"IF(NOT(ISBLANK(テーブル6[[#This Row],[水道施設]])),VLOOKUP(テーブル6[[#This Row],[水道施設]],水道[],2,TRUE), IF(NOT(ISBLANK(テーブル6[[#This Row],[許可区分（水道施設）]])),\"D\",\"-\"))","v":"-"}]
[12,"管内","日栄建設㈱","匝瑳市川辺4357-1","林　庸雄","0479-67-3431","0479-67-3432","特定",925,null,null,null,null,null,null,"特定",915,null,null,null,null,null,null,null,null,null,null,{"$f":"IF(NOT(ISBLANK(テーブル6[[#This Row],[土木一式]])),VLOOKUP(テーブル6[[#This Row],[土木一式]],土木[],2,TRUE), IF(NOT(ISBLANK(テーブル6[[#This Row],[許可区分(土木)]])),\"D\",\"-\"))","v":"A"},{"$f":"IF(NOT(ISBLANK(テーブル6[[#This Row],[建築一式]])),VLOOKUP(テーブル6[[#This Row],[建築一式]],建築[],2,TRUE), IF(NOT(ISBLANK(テーブル6[[#This Row],[許可区分（建築）]])),\"D\",\"-\"))","v":"-"},{"$f":"IF(NOT(ISBLANK(テーブル6[[#This Row],[電気]])),VLOOKUP(テーブル6[[#This Row],[電気]],電気[],2,TRUE), IF(NOT(ISBLANK(テーブル6[[#This Row],[許可区分（電気）]])),\"D\",\"-\"))","v":"-"},{"$f":"IF(NOT(ISBLANK(テーブル6[[#This Row],[管]])),VLOOKUP(テーブル6[[#This Row],[管]],管[],2,TRUE), IF(NOT(ISBLANK(テーブル6[[#This Row],[許可区分（管）]])),\"D\",\"-\"))","v":"-"},{"$f":"IF(NOT(ISBLANK(テーブル6[[#This Row],[ほ装]])),VLOOKUP(テーブル6[[#This Row],[ほ装]],ほ装[],2,TRUE), IF(NOT(ISBLANK(テーブル6[[#This Row],[許可区分(ほ装)]])),\"D\",\"-\"))","v":"A"},{"$f":"IF(NOT(ISBLANK(テーブル6[[#This Row],[塗装]])),VLOOKUP(テーブル6[[#This Row],[塗装]],塗装[],2,TRUE), IF(NOT(ISBLANK(テーブル6[[#This Row],[許可区分（塗装）]])),\"D\",\"-\"))","v":"-"},{"$f":"IF(NOT(ISBLANK(テーブル6[[#This Row],[防水]])),VLOOKUP(テーブル6[[#This Row],[防水]],塗装[],2,TRUE), IF(NOT(ISBLANK(テーブル6[[#This Row],[許可区分（防水）]])),\"D\",\"-\"))","v":"-"},{"$f":"IF(NOT(ISBLANK(テーブル6[[#This Row],[機械器具設置]])),VLOOKUP(テーブル6[[#This Row],[機械器具設置]],塗装[],2,TRUE), IF(NOT(ISBLANK(テーブル6[[#This Row],[許可区分（機械器具）]])),\"D\",\"-\"))","v":"-"},{"$f":"IF(NOT(ISBLANK(テーブル6[[#This Row],[電気通信]])),VLOOKUP(テーブル6[[#This Row],[電気通信]],電気[],2,TRUE), IF(NOT(ISBLANK(テーブル6[[#This Row],[許可区分(電気)]])),\"D\",\"-\"))","v":"-"},{"$f":"IF(NOT(ISBLANK(テーブル6[[#This Row],[水道施設]])),VLOOKUP(テーブル6[[#This Row],[水道施設]],水道[],2,TRUE), IF(NOT(ISBLANK(テーブル6[[#This Row],[許可区分（水道施設）]])),\"D\",\"-\"))","v":"-"}]
[13,"管内","㈲第一住宅設備","山武郡横芝光町二又1191","片岡　浩","0479-85-0034","0479-85-1500",null,null,null,null,null,null,"一般",681,null,null,null,null,null,null,null,null,null,null,null,null,{"$f":"IF(NOT(ISBLANK(テーブル6[[#This Row],[土木一式]])),VLOOKUP(テーブル6[[#This Row],[土木一式]],土木[],2,TRUE), IF(NOT(ISBLANK(テーブル6[[#This Row],[許可区分(土木)]])),\"D\",\"-\"))","v":"-"},{"$f":"IF(NOT(ISBLANK(テーブル6[[#This Row],[建築一式]])),VLOOKUP(テーブル6[[#This Row],[建築一式]],建築[],2,TRUE), IF(NOT(ISBLANK(テーブル6[[#This Row],[許可区分（建築）]])),\"D\",\"-\"))","v":"-"},{"$f":"IF(NOT(ISBLANK(テーブル6[[#This Row],[電気]])),VLOOKUP(テーブル6[[#This Row],[電気]],電気[],2,TRUE), IF(NOT(ISBLANK(テーブル6[[#This Row],[許可区分（電気）]])),\"D\",\"-\"))","v":"-"},{"$f":"IF(NOT(ISBLANK(テーブル6[[#This Row],[管]])),VLOOKUP(テーブル6[[#This Row],[管]],管[],2,TRUE), IF(NOT(ISBLANK(テーブル6[[#This Row],[許可区分（管）]])),\"D\",\"-\"))","v":"B"},{"$f":"IF(NOT(ISBLANK(テーブル6[[#This Row],[ほ装]])),VLOOKUP(テーブル6[[#This Row],[ほ装]],ほ装[],2,TRUE), IF(NOT(ISBLANK(テーブル6[[#This Row],[許可区分(ほ装)]])),\"D\",\"-\"))","v":"-"},{"$f":"IF(NOT(ISBLANK(テーブル6[[#This Row],[塗装]])),VLOOKUP(テーブル6[[#This Row],[塗装]],塗装[],2,TRUE), IF(NOT(ISBLANK(テーブル6[[#This Row],[許可区分（塗装）]])),\"D\",\"-\"))","v":"-"},{"$f":"IF(NOT(ISBLANK(テーブル6[[#This Row],[防水]])),VLOOKUP(テーブル6[[#This Row],[防水]],塗装[],2,TRUE), IF(NOT(ISBLANK(テーブル6[[#This Row],[許可区分（防水）]])),\"D\",\"-\"))","v":"-"},{"$f":"IF(NOT(ISBLANK(テーブル6[[#This Row],[機械器具設置]])),VLOOKUP(テーブル6[[#This Row],[機械器具設置]],塗装[],2,TRUE), IF(NOT(ISBLANK(テーブル6[[#This Row],[許可区分（機械器具）]])),\"D\",\"-\"))","v":"-"},{"$f":"IF(NOT(ISBLANK(テーブル6[[#This Row],[電気通信]])),VLOOKUP(テーブル6[[#This Row],[電気通信]],電気[],2,TRUE), IF(NOT(ISBLANK(テーブル6[[#This Row],[許可区分(電気)]])),\"D\",\"-\"))","v":"-"},{"$f":"IF(NOT(ISBLANK(テーブル6[[#This Row],[水道施設]])),VLOOKUP(テーブル6[[#This Row],[水道施設]],水道[],2,TRUE), IF(NOT(ISBLANK(テーブル6[[#This Row],[許可区分（水道施設）]])),\"D\",\"-\"))","v":"-"}]
[14,"管内","㈲川嶋土木","山武郡横芝光町尾垂ロ533","川嶋　清一","0479-84-0735","0479-84-0735","一般",684,null,null,null,null,"一般",613,"一般",645,null,null,null,null,null,null,null,null,null,null,{"$f":"IF(NOT(ISBLANK(テーブル6[[#This Row],[土木一式]])),VLOOKUP(テーブル6[[#This Row],[土木一式]],土木[],2,TRUE), IF(NOT(ISBLANK(テーブル6[[#This Row],[許可区分(土木)]])),\"D\",\"-\"))","v":"B"},{"$f":"IF(NOT(ISBLANK(テーブル6[[#This Row],[建築一式]])),VLOOKUP(テーブル6[[#This Row],[建築一式]],建築[],2,TRUE), IF(NOT(ISBLANK(テーブル6[[#This Row],[許可区分（建築）]])),\"D\",\"-\"))","v":"-"},{"$f":"IF(NOT(ISBLANK(テーブル6[[#This Row],[電気]])),VLOOKUP(テーブル6[[#This Row],[電気]],電気[],2,TRUE), IF(NOT(ISBLANK(テーブル6[[#This Row],[許可区分（電気）]])),\"D\",\"-\"))","v":"-"},{"$f":"IF(NOT(ISBLANK(テーブル6[[#This Row],[管]])),VLOOKUP(テーブル6[[#This Row],[管]],管[],2,TRUE), IF(NOT(ISBLANK(テーブル6[[#This Row],[許可区分（管）]])),\"D\",\"-\"))","v":"B"},{"$f":"IF(NOT(ISBLANK(テーブル6[[#This Row],[ほ装]])),VLOOKUP(テーブル6[[#This Row],[ほ装]],ほ装[],2,TRUE), IF(NOT(ISBLANK(テーブル6[[#This Row],[許可区分(ほ装)]])),\"D\",\"-\"))","v":"B"},{"$f":"IF(NOT(ISBLANK(テーブル6[[#This Row],[塗装]])),VLOOKUP(テーブル6[[#This Row],[塗装]],塗装[],2,TRUE), IF(NOT(ISBLANK(テーブル6[[#This Row],[許可区分（塗装）]])),\"D\",\"-\"))","v":"-"},{"$f":"IF(NOT(ISBLANK(テーブル6[[#This Row],[防水]])),VLOOKUP(テーブル6[[#This Row],[防水]],塗装[],2,TRUE), IF(NOT(ISBLANK(テーブル6[[#This Row],[許可区分（防水）]])),\"D\",\"-\"))","v":"-"},{"$f":"IF(NOT(ISBLANK(テーブル6[[#This Row],[機械器具設置]])),VLOOKUP(テーブル6[[#This Row],[機械器具設置]],塗装[],2,TRUE), IF(NOT(ISBLANK(テーブル6[[#This Row],[許可区分（機械器具）]])),\"D\",\"-\"))","v":"-"},{"$f":"IF(NOT(ISBLANK(テーブル6[[#This Row],[電気通信]])),VLOOKUP(テーブル6[[#This Row],[電気通信]],電気[],2,TRUE), IF(NOT(ISBLANK(テーブル6[[#This Row],[許可区分(電気)]])),\"D\",\"-\"))","v":"-"},{"$f":"IF(NOT(ISBLANK(テーブル6[[#This Row],[水道施設]])),VLOOKUP(テーブル6[[#This Row],[水道施設]],水道[],2,TRUE), IF(NOT(ISBLANK(テーブル6[[#This Row],[許可区分（水道施設）]])),\"D\",\"-\"))","v":"-"}]
[15,"管内","㈲岩井住宅設備","匝瑳市上谷中687","岩井　勇","0479-79-0356","0479-79-0357","一般",546,null,null,null,null,"一般",640,null,null,null,null,null,null,null,null,null,null,null,null,{"$f":"IF(NOT(ISBLANK(テーブル6[[#This Row],[土木一式]])),VLOOKUP(テーブル6[[#This Row],[土木一式]],土木[],2,TRUE), IF(NOT(ISBLANK(テーブル6[[#This Row],[許可区分(土木)]])),\"D\",\"-\"))","v":"D"},{"$f":"IF(NOT(ISBLANK(テーブル6[[#This Row],[建築一式]])),VLOOKUP(テーブル6[[#This Row],[建築一式]],建築[],2,TRUE), IF(NOT(ISBLANK(テーブル6[[#This Row],[許可区分（建築）]])),\"D\",\"-\"))","v":"-"},{"$f":"IF(NOT(ISBLANK(テーブル6[[#This Row],[電気]])),VLOOKUP(テーブル6[[#This Row],[電気]],電気[],2,TRUE), IF(NOT(ISBLANK(テーブル6[[#This Row],[許可区分（電気）]])),\"D\",\"-\"))","v":"-"},{"$f":"IF(NOT(ISBLANK(テーブル6[[#This Row],[管]])),VLOOKUP(テーブル6[[#This Row],[管]],管[],2,TRUE), IF(NOT(ISBLANK(テーブル6[[#This Row],[許可区分（管）]])),\"D\",\"-\"))","v":"B"},{"$f":"IF(NOT(ISBLANK(テーブル6[[#This Row],[ほ装]])),VLOOKUP(テーブル6[[#This Row],[ほ装]],ほ装[],2,TRUE), IF(NOT(ISBLANK(テーブル6[[#This Row],[許可区分(ほ装)]])),\"D\",\"-\"))","v":"-"},{"$f":"IF(NOT(ISBLANK(テーブル6[[#This Row],[塗装]])),VLOOKUP(テーブル6[[#This Row],[塗装]],塗装[],2,TRUE), IF(NOT(ISBLANK(テーブル6[[#This Row],[許可区分（塗装）]])),\"D\",\"-\"))","v":"-"},{"$f":"IF(NOT(ISBLANK(テーブル6[[#This Row],[防水]])),VLOOKUP(テーブル6[[#This Row],[防水]],塗装[],2,TRUE), IF(NOT(ISBLANK(テーブル6[[#This Row],[許可区分（防水）]])),\"D\",\"-\"))","v":"-"},{"$f":"IF(NOT(ISBLANK(テーブル6[[#This Row],[機械器具設置]])),VLOOKUP(テーブル6[[#This Row],[機械器具設置]],塗装[],2,TRUE), IF(NOT(ISBLANK(テーブル6[[#This Row],[許可区分（機械器具）]])),\"D\",\"-\"))","v":"-"},{"$f":"IF(NOT(ISBLANK(テーブル6[[#This Row],[電気通信]])),VLOOKUP(テーブル6[[#This Row],[電気通信]],電気[],2,TRUE), IF(NOT(ISBLANK(テーブル6[[#This Row],[許可区分(電気)]])),\"D\",\"-\"))","v":"-"},{"$f":"IF(NOT(ISBLANK(テーブル6[[#This Row],[水道施設]])),VLOOKUP(テーブル6[[#This Row],[水道施設]],水道[],2,TRUE), IF(NOT(ISBLANK(テーブル6[[#This Row],[許可区分（水道施設）]])),\"D\",\"-\"))","v":"-"}]
[16,"管内","三幸電機","匝瑳市八日市場イ2508","岩﨑　清隆","0479-72-0893","0479-73-6318","一般",654,null,null,null,null,"一般",660,"一般",589,null,null,null,null,null,null,null,null,null,null,{"$f":"IF(NOT(ISBLANK(テーブル6[[#This Row],[土木一式]])),VLOOKUP(テーブル6[[#This Row],[土木一式]],土木[],2,TRUE), IF(NOT(ISBLANK(テーブル6[[#This Row],[許可区分(土木)]])),\"D\",\"-\"))","v":"B"},{"$f":"IF(NOT(ISBLANK(テーブル6[[#This Row],[建築一式]])),VLOOKUP(テーブル6[[#This Row],[建築一式]],建築[],2,TRUE), IF(NOT(ISBLANK(テーブル6[[#This Row],[許可区分（建築）]])),\"D\",\"-\"))","v":"-"},{"$f":"IF(NOT(ISBLANK(テーブル6[[#This Row],[電気]])),VLOOKUP(テーブル6[[#This Row],[電気]],電気[],2,TRUE), IF(NOT(ISBLANK(テーブル6[[#This Row],[許可区分（電気）]])),\"D\",\"-\"))","v":"-"},{"$f":"IF(NOT(ISBLANK(テーブル6[[#This Row],[管]])),VLOOKUP(テーブル6[[#This Row],[管]],管[],2,TRUE), IF(NOT(ISBLANK(テーブル6[[#This Row],[許可区分（管）]])),\"D\",\"-\"))","v":"B"},{"$f":"IF(NOT(ISBLANK(テーブル6[[#This Row],[ほ装]])),VLOOKUP(テーブル6[[#This Row],[ほ装]],ほ装[],2,TRUE), IF(NOT(ISBLANK(テーブル6[[#This Row],[許可区分(ほ装)]])),\"D\",\"-\"))","v":"C"},{"$f":"IF(NOT(ISBLANK(テーブル6[[#This Row],[塗装]])),VLOOKUP(テーブル6[[#This Row],[塗装]],塗装[],2,TRUE), IF(NOT(ISBLANK(テーブル6[[#This Row],[許可区分（塗装）]])),\"D\",\"-\"))","v":"-"},{"$f":"IF(NOT(ISBLANK(テーブル6[[#This Row],[防水]])),VLOOKUP(テーブル6[[#This Row],[防水]],塗装[],2,TRUE), IF(NOT(ISBLANK(テーブル6[[#This Row],[許可区分（防水）]])),\"D\",\"-\"))","v":"-"},{"$f":"IF(NOT(ISBLANK(テーブル6[[#This Row],[機械器具設置]])),VLOOKUP(テーブル6[[#This Row],[機械器具設置]],塗装[],2,TRUE), IF(NOT(ISBLANK(テーブル6[[#This Row],[許可区分（機械器具）]])),\"D\",\"-\"))","v":"-"},{"$f":"IF(NOT(ISBLANK(テーブル6[[#This Row],[電気通信]])),VLOOKUP(テーブル6[[#This Row],[電気通信]],電気[],2,TRUE), IF(NOT(ISBLANK(テーブル6[[#This Row],[許可区分(電気)]])),\"D\",\"-\"))","v":"-"},{"$f":"IF(NOT(ISBLANK(テーブル6[[#This Row],[水道施設]])),VLOOKUP(テーブル6[[#This Row],[水道施設]],水道[],2,TRUE), IF(NOT(ISBLANK(テーブル6[[#This Row],[許可区分（水道施設）]])),\"D\",\"-\"))","v":"-"}]
[17,"管内","㈲山石工業","匝瑳市堀川6225-1","江波戸　正文","0479-67-5212","0479-67-5217","一般",795,null,null,null,null,null,null,"一般",779,null,null,null,null,null,null,null,null,null,null,{"$f":"IF(NOT(ISBLANK(テーブル6[[#This Row],[土木一式]])),VLOOKUP(テーブル6[[#This Row],[土木一式]],土木[],2,TRUE), IF(NOT(ISBLANK(テーブル6[[#This Row],[許可区分(土木)]])),\"D\",\"-\"))","v":"A"},{"$f":"IF(NOT(ISBLANK(テーブル6[[#This Row],[建築一式]])),VLOOKUP(テーブル6[[#This Row],[建築一式]],建築[],2,TRUE), IF(NOT(ISBLANK(テーブル6[[#This Row],[許可区分（建築）]])),\"D\",\"-\"))","v":"-"},{"$f":"IF(NOT(ISBLANK(テーブル6[[#This Row],[電気]])),VLOOKUP(テーブル6[[#This Row],[電気]],電気[],2,TRUE), IF(NOT(ISBLANK(テーブル6[[#This Row],[許可区分（電気）]])),\"D\",\"-\"))","v":"-"},{"$f":"IF(NOT(ISBLANK(テーブル6[[#This Row],[管]])),VLOOKUP(テーブル6[[#This Row],[管]],管[],2,TRUE), IF(NOT(ISBLANK(テーブル6[[#This Row],[許可区分（管）]])),\"D\",\"-\"))","v":"-"},{"$f":"IF(NOT(ISBLANK(テーブル6[[#This Row],[ほ装]])),VLOOKUP(テーブル6[[#This Row],[ほ装]],ほ装[],2,TRUE), IF(NOT(ISBLANK(テーブル6[[#This Row],[許可区分(ほ装)]])),\"D\",\"-\"))","v":"A"},{"$f":"IF(NOT(ISBLANK(テーブル6[[#This Row],[塗装]])),VLOOKUP(テーブル6[[#This Row],[塗装]],塗装[],2,TRUE), IF(NOT(ISBLANK(テーブル6[[#This Row],[許可区分（塗装）]])),\"D\",\"-\"))","v":"-"},{"$f":"IF(NOT(ISBLANK(テーブル6[[#This Row],[防水]])),VLOOKUP(テーブル6[[#This Row],[防水]],塗装[],2,TRUE), IF(NOT(ISBLANK(テーブル6[[#This Row],[許可区分（防水）]])),\"D\",\"-\"))","v":"-"},{"$f":"IF(NOT(ISBLANK(テーブル6[[#This Row],[機械器具設置]])),VLOOKUP(テーブル6[[#This Row],[機械器具設置]],塗装[],2,TRUE), IF(NOT(ISBLANK(テーブル6[[#This Row],[許可区分（機械器具）]])),\"D\",\"-\"))","v":"-"},{"$f":"IF(NOT(ISBLANK(テーブル6[[#This Row],[電気通信]])),VLOOKUP(テーブル6[[#This Row],[電気通信]],電気[],2,TRUE), IF(NOT(ISBLANK(テーブル6[[#This Row],[許可区分(電気)]])),\"D\",\"-\"))","v":"-"},{"$f":"IF(NOT(ISBLANK(テーブル6[[#This Row],[水道施設]])),VLOOKUP(テーブル6[[#This Row],[水道施設]],水道[],2,TRUE), IF(NOT(ISBLANK(テーブル6[[#This Row],[許可区分（水道施設）]])),\"D\",\"-\"))","v":"-"}]
[18,"管内","㈲伊東設備","匝瑳市野手17146-545","伊東　幸雄","0479-67-3324","0479-67-5436",null,null,null,null,null,null,"一般",null,null,null,null,null,null,null,null,null,null,null,null,null,{"$f":"IF(NOT(ISBLANK(テーブル6[[#This Row],[土木一式]])),VLOOKUP(テーブル6[[#This Row],[土木一式]],土木[],2,TRUE), IF(NOT(ISBLANK(テーブル6[[#This Row],[許可区分(土木)]])),\"D\",\"-\"))","v":"-"},{"$f":"IF(NOT(ISBLANK(テーブル6[[#This Row],[建築一式]])),VLOOKUP(テーブル6[[#This Row],[建築一式]],建築[],2,TRUE), IF(NOT(ISBLANK(テーブル6[[#This Row],[許可区分（建築）]])),\"D\",\"-\"))","v":"-"},{"$f":"IF(NOT(ISBLANK(テーブル6[[#This Row],[電気]])),VLOOKUP(テーブル6[[#This Row],[電気]],電気[],2,TRUE), IF(NOT(ISBLANK(テーブル6[[#This Row],[許可区分（電気）]])),\"D\",\"-\"))","v":"-"},{"$f":"IF(NOT(ISBLANK(テーブル6[[#This Row],[管]])),VLOOKUP(テーブル6[[#This Row],[管]],管[],2,TRUE), IF(NOT(ISBLANK(テーブル6[[#This Row],[許可区分（管）]])),\"D\",\"-\"))","v":"D"},{"$f":"IF(NOT(ISBLANK(テーブル6[[#This Row],[ほ装]])),VLOOKUP(テーブル6[[#This Row],[ほ装]],ほ装[],2,TRUE), IF(NOT(ISBLANK(テーブル6[[#This Row],[許可区分(ほ装)]])),\"D\",\"-\"))","v":"-"},{"$f":"IF(NOT(ISBLANK(テーブル6[[#This Row],[塗装]])),VLOOKUP(テーブル6[[#This Row],[塗装]],塗装[],2,TRUE), IF(NOT(ISBLANK(テーブル6[[#This Row],[許可区分（塗装）]])),\"D\",\"-\"))","v":"-"},{"$f":"IF(NOT(ISBLANK(テーブル6[[#This Row],[防水]])),VLOOKUP(テーブル6[[#This Row],[防水]],塗装[],2,TRUE), IF(NOT(ISBLANK(テーブル6[[#This Row],[許可区分（防水）]])),\"D\",\"-\"))","v":"-"},{"$f":"IF(NOT(ISBLANK(テーブル6[[#This Row],[機械器具設置]])),VLOOKUP(テーブル6[[#This Row],[機械器具設置]],塗装[],2,TRUE), IF(NOT(ISBLANK(テーブル6[[#This Row],[許可区分（機械器具）]])),\"D\",\"-\"))","v":"-"},{"$f":"IF(NOT(ISBLANK(テーブル6[[#This Row],[電気通信]])),VLOOKUP(テーブル6[[#This Row],[電気通信]],電気[],2,TRUE), IF(NOT(ISBLANK(テーブル6[[#This Row],[許可区分(電気)]])),\"D\",\"-\"))","v":"-"},{"$f":"IF(NOT(ISBLANK(テーブル6[[#This Row],[水道施設]])),VLOOKUP(テーブル6[[#This Row],[水道施設]],水道[],2,TRUE), IF(NOT(ISBLANK(テーブル6[[#This Row],[許可区分（水道施設）]])),\"D\",\"-\"))","v":"-"}]
[19,"管内","㈲加瀬建設","山武郡横芝光町原方1088-1","加瀬　正義","0479-84-1824","0479-84-2663","一般",658,"一般",599,null,null,null,null,"一般",575,null,null,null,null,null,null,null,null,"一般",547,{"$f":"IF(NOT(ISBLANK(テーブル6[[#This Row],[土木一式]])),VLOOKUP(テーブル6[[#This Row],[土木一式]],土木[],2,TRUE), IF(NOT(ISBLANK(テーブル6[[#This Row],[許可区分(土木)]])),\"D\",\"-\"))","v":"B"},{"$f":"IF(NOT(ISBLANK(テーブル6[[#This Row],[建築一式]])),VLOOKUP(テーブル6[[#This Row],[建築一式]],建築[],2,TRUE), IF(NOT(ISBLANK(テーブル6[[#This Row],[許可区分（建築）]])),\"D\",\"-\"))","v":"D"},{"$f":"IF(NOT(ISBLANK(テーブル6[[#This Row],[電気]])),VLOOKUP(テーブル6[[#This Row],[電気]],電気[],2,TRUE), IF(NOT(ISBLANK(テーブル6[[#This Row],[許可区分（電気）]])),\"D\",\"-\"))","v":"-"},{"$f":"IF(NOT(ISBLANK(テーブル6[[#This Row],[管]])),VLOOKUP(テーブル6[[#This Row],[管]],管[],2,TRUE), IF(NOT(ISBLANK(テーブル6[[#This Row],[許可区分（管）]])),\"D\",\"-\"))","v":"-"},{"$f":"IF(NOT(ISBLANK(テーブル6[[#This Row],[ほ装]])),VLOOKUP(テーブル6[[#This Row],[ほ装]],ほ装[],2,TRUE), IF(NOT(ISBLANK(テーブル6[[#This Row],[許可区分(ほ装)]])),\"D\",\"-\"))","v":"C"},{"$f":"IF(NOT(ISBLANK(テーブル6[[#This Row],[塗装]])),VLOOKUP(テーブル6[[#This Row],[塗装]],塗装[],2,TRUE), IF(NOT(ISBLANK(テーブル6[[#This Row],[許可区分（塗装）]])),\"D\",\"-\"))","v":"-"},{"$f":"IF(NOT(ISBLANK(テーブル6[[#This Row],[防水]])),VLOOKUP(テーブル6[[#This Row],[防水]],塗装[],2,TRUE), IF(NOT(ISBLANK(テーブル6[[#This Row],[許可区分（防水）]])),\"D\",\"-\"))","v":"-"},{"$f":"IF(NOT(ISBLANK(テーブル6[[#This Row],[機械器具設置]])),VLOOKUP(テーブル6[[#This Row],[機械器具設置]],塗装[],2,TRUE), IF(NOT(ISBLANK(テーブル6[[#This Row],[許可区分（機械器具）]])),\"D\",\"-\"))","v":"-"},{"$f":"IF(NOT(ISBLANK(テーブル6[[#This Row],[電気通信]])),VLOOKUP(テーブル6[[#This Row],[電気通信]],電気[],2,TRUE), IF(NOT(ISBLANK(テーブル6[[#This Row],[許可区分(電気)]])),\"D\",\"-\"))","v":"-"},{"$f":"IF(NOT(ISBLANK(テーブル6[[#This Row],[水道施設]])),VLOOKUP(テーブル6[[#This Row],[水道施設]],水道[],2,TRUE), IF(NOT(ISBLANK(テーブル6[[#This Row],[許可区分（水道施設）]])),\"D\",\"-\"))","v":"D"}]
[20,"管内","㈱中央工業","山武郡横芝光町宮川6019-4","石井　康晴","0479-84-1205","0479-84-2850","一般",507,null,null,null,null,"一般",581,null,null,null,null,null,null,null,null,null,null,null,null,{"$f":"IF(NOT(ISBLANK(テーブル6[[#This Row],[土木一式]])),VLOOKUP(テーブル6[[#This Row],[土木一式]],土木[],2,TRUE), IF(NOT(ISBLANK(テーブル6[[#This Row],[許可区分(土木)]])),\"D\",\"-\"))","v":"D"},{"$f":"IF(NOT(ISBLANK(テーブル6[[#This Row],[建築一式]])),VLOOKUP(テーブル6[[#This Row],[建築一式]],建築[],2,TRUE), IF(NOT(ISBLANK(テーブル6[[#This Row],[許可区分（建築）]])),\"D\",\"-\"))","v":"-"},{"$f":"IF(NOT(ISBLANK(テーブル6[[#This Row],[電気]])),VLOOKUP(テーブル6[[#This Row],[電気]],電気[],2,TRUE), IF(NOT(ISBLANK(テーブル6[[#This Row],[許可区分（電気）]])),\"D\",\"-\"))","v":"-"},{"$f":"IF(NOT(ISBLANK(テーブル6[[#This Row],[管]])),VLOOKUP(テーブル6[[#This Row],[管]],管[],2,TRUE), IF(NOT(ISBLANK(テーブル6[[#This Row],[許可区分（管）]])),\"D\",\"-\"))","v":"C"},{"$f":"IF(NOT(ISBLANK(テーブル6[[#This Row],[ほ装]])),VLOOKUP(テーブル6[[#This Row],[ほ装]],ほ装[],2,TRUE), IF(NOT(ISBLANK(テーブル6[[#This Row],[許可区分(ほ装)]])),\"D\",\"-\"))","v":"-"},{"$f":"IF(NOT(ISBLANK(テーブル6[[#This Row],[塗装]])),VLOOKUP(テーブル6[[#This Row],[塗装]],塗装[],2,TRUE), IF(NOT(ISBLANK(テーブル6[[#This Row],[許可区分（塗装）]])),\"D\",\"-\"))","v":"-"},{"$f":"IF(NOT(ISBLANK(テーブル6[[#This Row],[防水]])),VLOOKUP(テーブル6[[#This Row],[防水]],塗装[],2,TRUE), IF(NOT(ISBLANK(テーブル6[[#This Row],[許可区分（防水）]])),\"D\",\"-\"))","v":"-"},{"$f":"IF(NOT(ISBLANK(テーブル6[[#This Row],[機械器具設置]])),VLOOKUP(テーブル6[[#This Row],[機械器具設置]],塗装[],2,TRUE), IF(NOT(ISBLANK(テーブル6[[#This Row],[許可区分（機械器具）]])),\"D\",\"-\"))","v":"-"},{"$f":"IF(NOT(ISBLANK(テーブル6[[#This Row],[電気通信]])),VLOOKUP(テーブル6[[#This Row],[電気通信]],電気[],2,TRUE), IF(NOT(ISBLANK(テーブル6[[#This Row],[許可区分(電気)]])),\"D\",\"-\"))","v":"-"},{"$f":"IF(NOT(ISBLANK(テーブル6[[#This Row],[水道施設]])),VLOOKUP(テーブル6[[#This Row],[水道施設]],水道[],2,TRUE), IF(NOT(ISBLANK(テーブル6[[#This Row],[許可区分（水道施設）]])),\"D\",\"-\"))","v":"-"}]
[21,"管内","㈱プレスト","匝瑳市八日市場ハ725-1","林　光宏","0479-72-3312","0479-72-3351","一般",779,"一般",617,null,null,null,null,"一般",699,null,null,null,null,null,null,null,null,null,null,{"$f":"IF(NOT(ISBLANK(テーブル6[[#This Row],[土木一式]])),VLOOKUP(テーブル6[[#This Row],[土木一式]],土木[],2,TRUE), IF(NOT(ISBLANK(テーブル6[[#This Row],[許可区分(土木)]])),\"D\",\"-\"))","v":"A"},{"$f":"IF(NOT(ISBLANK(テーブル6[[#This Row],[建築一式]])),VLOOKUP(テーブル6[[#This Row],[建築一式]],建築[],2,TRUE), IF(NOT(ISBLANK(テーブル6[[#This Row],[許可区分（建築）]])),\"D\",\"-\"))","v":"C"},{"$f":"IF(NOT(ISBLANK(テーブル6[[#This Row],[電気]])),VLOOKUP(テーブル6[[#This Row],[電気]],電気[],2,TRUE), IF(NOT(ISBLANK(テーブル6[[#This Row],[許可区分（電気）]])),\"D\",\"-\"))","v":"-"},{"$f":"IF(NOT(ISBLANK(テーブル6[[#This Row],[管]])),VLOOKUP(テーブル6[[#This Row],[管]],管[],2,TRUE), IF(NOT(ISBLANK(テーブル6[[#This Row],[許可区分（管）]])),\"D\",\"-\"))","v":"-"},{"$f":"IF(NOT(ISBLANK(テーブル6[[#This Row],[ほ装]])),VLOOKUP(テーブル6[[#This Row],[ほ装]],ほ装[],2,TRUE), IF(NOT(ISBLANK(テーブル6[[#This Row],[許可区分(ほ装)]])),\"D\",\"-\"))","v":"B"},{"$f":"IF(NOT(ISBLANK(テーブル6[[#This Row],[塗装]])),VLOOKUP(テーブル6[[#This Row],[塗装]],塗装[],2,TRUE), IF(NOT(ISBLANK(テーブル6[[#This Row],[許可区分（塗装）]])),\"D\",\"-\"))","v":"-"},{"$f":"IF(NOT(ISBLANK(テーブル6[[#This Row],[防水]])),VLOOKUP(テーブル6[[#This Row],[防水]],塗装[],2,TRUE), IF(NOT(ISBLANK(テーブル6[[#This Row],[許可区分（防水）]])),\"D\",\"-\"))","v":"-"},{"$f":"IF(NOT(ISBLANK(テーブル6[[#This Row],[機械器具設置]])),VLOOKUP(テーブル6[[#This Row],[機械器具設置]],塗装[],2,TRUE), IF(NOT(ISBLANK(テーブル6[[#This Row],[許可区分（機械器具）]])),\"D\",\"-\"))","v":"-"},{"$f":"IF(NOT(ISBLANK(テーブル6[[#This Row],[電気通信]])),VLOOKUP(テーブル6[[#This Row],[電気通信]],電気[],2,TRUE), IF(NOT(ISBLANK(テーブル6[[#This Row],[許可区分(電気)]])),\"D\",\"-\"))","v":"-"},{"$f":"IF(NOT(ISBLANK(テーブル6[[#This Row],[水道施設]])),VLOOKUP(テーブル6[[#This Row],[水道施設]],水道[],2,TRUE), IF(NOT(ISBLANK(テーブル6[[#This Row],[許可区分（水道施設）]])),\"D\",\"-\"))","v":"-"},"土木一式、建築一式、舗装"]
[22,"管内","㈱双雲","匝瑳市椿1663-16","松戸　一裕","0479-85-6204","0479-72-3256","一般",619,null,null,null,null,"一般",737,"一般",619,null,null,null,null,null,null,null,null,"一般",614,{"$f":"IF(NOT(ISBLANK(テーブル6[[#This Row],[土木一式]])),VLOOKUP(テーブル6[[#This Row],[土木一式]],土木[],2,TRUE), IF(NOT(ISBLANK(テーブル6[[#This Row],[許可区分(土木)]])),\"D\",\"-\"))","v":"C"},{"$f":"IF(NOT(ISBLANK(テーブル6[[#This Row],[建築一式]])),VLOOKUP(テーブル6[[#This Row],[建築一式]],建築[],2,TRUE), IF(NOT(ISBLANK(テーブル6[[#This Row],[許可区分（建築）]])),\"D\",\"-\"))","v":"-"},{"$f":"IF(NOT(ISBLANK(テーブル6[[#This Row],[電気]])),VLOOKUP(テーブル6[[#This Row],[電気]],電気[],2,TRUE), IF(NOT(ISBLANK(テーブル6[[#This Row],[許可区分（電気）]])),\"D\",\"-\"))","v":"-"},{"$f":"IF(NOT(ISBLANK(テーブル6[[#This Row],[管]])),VLOOKUP(テーブル6[[#This Row],[管]],管[],2,TRUE), IF(NOT(ISBLANK(テーブル6[[#This Row],[許可区分（管）]])),\"D\",\"-\"))","v":"A"},{"$f":"IF(NOT(ISBLANK(テーブル6[[#This Row],[ほ装]])),VLOOKUP(テーブル6[[#This Row],[ほ装]],ほ装[],2,TRUE), IF(NOT(ISBLANK(テーブル6[[#This Row],[許可区分(ほ装)]])),\"D\",\"-\"))","v":"B"},{"$f":"IF(NOT(ISBLANK(テーブル6[[#This Row],[塗装]])),VLOOKUP(テーブル6[[#This Row],[塗装]],塗装[],2,TRUE), IF(NOT(ISBLANK(テーブル6[[#This Row],[許可区分（塗装）]])),\"D\",\"-\"))","v":"-"},{"$f":"IF(NOT(ISBLANK(テーブル6[[#This Row],[防水]])),VLOOKUP(テーブル6[[#This Row],[防水]],塗装[],2,TRUE), IF(NOT(ISBLANK(テーブル6[[#This Row],[許可区分（防水）]])),\"D\",\"-\"))","v":"-"},{"$f":"IF(NOT(ISBLANK(テーブル6[[#This Row],[機械器具設置]])),VLOOKUP(テーブル6[[#This Row],[機械器具設置]],塗装[],2,TRUE), IF(NOT(ISBLANK(テーブル6[[#This Row],[許可区分（機械器具）]])),\"D\",\"-\"))","v":"-"},{"$f":"IF(NOT(ISBLANK(テーブル6[[#This Row],[電気通信]])),VLOOKUP(テーブル6[[#This Row],[電気通信]],電気[],2,TRUE), IF(NOT(ISBLANK(テーブル6[[#This Row],[許可区分(電気)]])),\"D\",\"-\"))","v":"-"},{"$f":"IF(NOT(ISBLANK(テーブル6[[#This Row],[水道施設]])),VLOOKUP(テーブル6[[#This Row],[水道施設]],水道[],2,TRUE), IF(NOT(ISBLANK(テーブル6[[#This Row],[許可区分（水道施設）]])),\"D\",\"-\"))","v":"C"}]
[23,"管内","㈱ヘイワ","匝瑳市上谷中2181","香取　正穗","0479-72-1165","0479-73-5565","特定",809,"特定",735,null,null,null,null,"特定",610,null,null,null,null,null,null,null,null,null,null,{"$f":"IF(NOT(ISBLANK(テーブル6[[#This Row],[土木一式]])),VLOOKUP(テーブル6[[#This Row],[土木一式]],土木[],2,TRUE), IF(NOT(ISBLANK(テーブル6[[#This Row],[許可区分(土木)]])),\"D\",\"-\"))","v":"A"},{"$f":"IF(NOT(ISBLANK(テーブル6[[#This Row],[建築一式]])),VLOOKUP(テーブル6[[#This Row],[建築一式]],建築[],2,TRUE), IF(NOT(ISBLANK(テーブル6[[#This Row],[許可区分（建築）]])),\"D\",\"-\"))","v":"B"},{"$f":"IF(NOT(ISBLANK(テーブル6[[#This Row],[電気]])),VLOOKUP(テーブル6[[#This Row],[電気]],電気[],2,TRUE), IF(NOT(ISBLANK(テーブル6[[#This Row],[許可区分（電気）]])),\"D\",\"-\"))","v":"-"},{"$f":"IF(NOT(ISBLANK(テーブル6[[#This Row],[管]])),VLOOKUP(テーブル6[[#This Row],[管]],管[],2,TRUE), IF(NOT(ISBLANK(テーブル6[[#This Row],[許可区分（管）]])),\"D\",\"-\"))","v":"-"},{"$f":"IF(NOT(ISBLANK(テーブル6[[#This Row],[ほ装]])),VLOOKUP(テーブル6[[#This Row],[ほ装]],ほ装[],2,TRUE), IF(NOT(ISBLANK(テーブル6[[#This Row],[許可区分(ほ装)]])),\"D\",\"-\"))","v":"B"},{"$f":"IF(NOT(ISBLANK(テーブル6[[#This Row],[塗装]])),VLOOKUP(テーブル6[[#This Row],[塗装]],塗装[],2,TRUE), IF(NOT(ISBLANK(テーブル6[[#This Row],[許可区分（塗装）]])),\"D\",\"-\"))","v":"-"},{"$f":"IF(NOT(ISBLANK(テーブル6[[#This Row],[防水]])),VLOOKUP(テーブル6[[#This Row],[防水]],塗装[],2,TRUE), IF(NOT(ISBLANK(テーブル6[[#This Row],[許可区分（防水）]])),\"D\",\"-\"))","v":"-"},{"$f":"IF(NOT(ISBLANK(テーブル6[[#This Row],[機械器具設置]])),VLOOKUP(テーブル6[[#This Row],[機械器具設置]],塗装[],2,TRUE), IF(NOT(ISBLANK(テーブル6[[#This Row],[許可区分（機械器具）]])),\"D\",\"-\"))","v":"-"},{"$f":"IF(NOT(ISBLANK(テーブル6[[#This Row],[電気通信]])),VLOOKUP(テーブル6[[#This Row],[電気通信]],電気[],2,TRUE), IF(NOT(ISBLANK(テーブル6[[#This Row],[許可区分(電気)]])),\"D\",\"-\"))","v":"-"},{"$f":"IF(NOT(ISBLANK(テーブル6[[#This Row],[水道施設]])),VLOOKUP(テーブル6[[#This Row],[水道施設]],水道[],2,TRUE), IF(NOT(ISBLANK(テーブル6[[#This Row],[許可区分（水道施設）]])),\"D\",\"-\"))","v":"-"}]
[24,"管内","向後汽力工業㈱","匝瑳市大寺1240-3","向後　恵理子","0479-74-0001","0479-74-1777",null,null,null,null,null,null,"一般",751,null,null,null,null,null,null,null,null,null,null,null,null,{"$f":"IF(NOT(ISBLANK(テーブル6[[#This Row],[土木一式]])),VLOOKUP(テーブル6[[#This Row],[土木一式]],土木[],2,TRUE), IF(NOT(ISBLANK(テーブル6[[#This Row],[許可区分(土木)]])),\"D\",\"-\"))","v":"-"},{"$f":"IF(NOT(ISBLANK(テーブル6[[#This Row],[建築一式]])),VLOOKUP(テーブル6[[#This Row],[建築一式]],建築[],2,TRUE), IF(NOT(ISBLANK(テーブル6[[#This Row],[許可区分（建築）]])),\"D\",\"-\"))","v":"-"},{"$f":"IF(NOT(ISBLANK(テーブル6[[#This Row],[電気]])),VLOOKUP(テーブル6[[#This Row],[電気]],電気[],2,TRUE), IF(NOT(ISBLANK(テーブル6[[#This Row],[許可区分（電気）]])),\"D\",\"-\"))","v":"-"},{"$f":"IF(NOT(ISBLANK(テーブル6[[#This Row],[管]])),VLOOKUP(テーブル6[[#This Row],[管]],管[],2,TRUE), IF(NOT(ISBLANK(テーブル6[[#This Row],[許可区分（管）]])),\"D\",\"-\"))","v":"A"},{"$f":"IF(NOT(ISBLANK(テーブル6[[#This Row],[ほ装]])),VLOOKUP(テーブル6[[#This Row],[ほ装]],ほ装[],2,TRUE), IF(NOT(ISBLANK(テーブル6[[#This Row],[許可区分(ほ装)]])),\"D\",\"-\"))","v":"-"},{"$f":"IF(NOT(ISBLANK(テーブル6[[#This Row],[塗装]])),VLOOKUP(テーブル6[[#This Row],[塗装]],塗装[],2,TRUE), IF(NOT(ISBLANK(テーブル6[[#This Row],[許可区分（塗装）]])),\"D\",\"-\"))","v":"-"},{"$f":"IF(NOT(ISBLANK(テーブル6[[#This Row],[防水]])),VLOOKUP(テーブル6[[#This Row],[防水]],塗装[],2,TRUE), IF(NOT(ISBLANK(テーブル6[[#This Row],[許可区分（防水）]])),\"D\",\"-\"))","v":"-"},{"$f":"IF(NOT(ISBLANK(テーブル6[[#This Row],[機械器具設置]])),VLOOKUP(テーブル6[[#This Row],[機械器具設置]],塗装[],2,TRUE), IF(NOT(ISBLANK(テーブル6[[#This Row],[許可区分（機械器具）]])),\"D\",\"-\"))","v":"-"},{"$f":"IF(NOT(ISBLANK(テーブル6[[#This Row],[電気通信]])),VLOOKUP(テーブル6[[#This Row],[電気通信]],電気[],2,TRUE), IF(NOT(ISBLANK(テーブル6[[#This Row],[許可区分(電気)]])),\"D\",\"-\"))","v":"-"},{"$f":"IF(NOT(ISBLANK(テーブル6[[#This Row],[水道施設]])),VLOOKUP(テーブル6[[#This Row],[水道施設]],水道[],2,TRUE), IF(NOT(ISBLANK(テーブル6[[#This Row],[許可区分（水道施設）]])),\"D\",\"-\"))","v":"-"}]
[25,"管内","向後汽力工業㈱","匝瑳市大寺1240-3","向後　恵理子","0479-74-0001","0479-74-1777",null,null,null,null,null,null,null,null,null,null,null,null,null,null,null,null,null,null,null,null,{"$f":"IF(NOT(ISBLANK(テーブル6[[#This Row],[土木一式]])),VLOOKUP(テーブル6[[#This Row],[土木一式]],土木[],2,TRUE), IF(NOT(ISBLANK(テーブル6[[#This Row],[許可区分(土木)]])),\"D\",\"-\"))","v":"-"},{"$f":"IF(NOT(ISBLANK(テーブル6[[#This Row],[建築一式]])),VLOOKUP(テーブル6[[#This Row],[建築一式]],建築[],2,TRUE), IF(NOT(ISBLANK(テーブル6[[#This Row],[許可区分（建築）]])),\"D\",\"-\"))","v":"-"},{"$f":"IF(NOT(ISBLANK(テーブル6[[#This Row],[電気]])),VLOOKUP(テーブル6[[#This Row],[電気]],電気[],2,TRUE), IF(NOT(ISBLANK(テーブル6[[#This Row],[許可区分（電気）]])),\"D\",\"-\"))","v":"-"},{"$f":"IF(NOT(ISBLANK(テーブル6[[#This Row],[管]])),VLOOKUP(テーブル6[[#This Row],[管]],管[],2,TRUE), IF(NOT(ISBLANK(テーブル6[[#This Row],[許可区分（管）]])),\"D\",\"-\"))","v":"-"},{"$f":"IF(NOT(ISBLANK(テーブル6[[#This Row],[ほ装]])),VLOOKUP(テーブル6[[#This Row],[ほ装]],ほ装[],2,TRUE), IF(NOT(ISBLANK(テーブル6[[#This Row],[許可区分(ほ装)]])),\"D\",\"-\"))","v":"-"},{"$f":"IF(NOT(ISBLANK(テーブル6[[#This Row],[塗装]])),VLOOKUP(テーブル6[[#This Row],[塗装]],塗装[],2,TRUE), IF(NOT(ISBLANK(テーブル6[[#This Row],[許可区分（塗装）]])),\"D\",\"-\"))","v":"-"},{"$f":"IF(NOT(ISBLANK(テーブル6[[#This Row],[防水]])),VLOOKUP(テーブル6[[#This Row],[防水]],塗装[],2,TRUE), IF(NOT(ISBLANK(テーブル6[[#This Row],[許可区分（防水）]])),\"D\",\"-\"))","v":"-"},{"$f":"IF(NOT(ISBLANK(テーブル6[[#This Row],[機械器具設置]])),VLOOKUP(テーブル6[[#This Row],[機械器具設置]],塗装[],2,TRUE), IF(NOT(ISBLANK(テーブル6[[#This Row],[許可区分（機械器具）]])),\"D\",\"-\"))","v":"-"},{"$f":"IF(NOT(ISBLANK(テーブル6[[#This Row],[電気通信]])),VLOOKUP(テーブル6[[#This Row],[電気通信]],電気[],2,TRUE), IF(NOT(ISBLANK(テーブル6[[#This Row],[許可区分(電気)]])),\"D\",\"-\"))","v":"-"},{"$f":"IF(NOT(ISBLANK(テーブル6[[#This Row],[水道施設]])),VLOOKUP(テーブル6[[#This Row],[水道施設]],水道[],2,TRUE), IF(NOT(ISBLANK(テーブル6[[#This Row],[許可区分（水道施設）]])),\"D\",\"-\"))","v":"-"},"建築設備保守、建物清掃"]
[26,"管内","㈱松伊燃料店","匝瑳市八日市場イ2493","片岡　勝美","0479-72-0147","0479-73-2286",null,null,null,null,null,null,"一般",null,null,null,null,null,null,null,null,null,null,null,null,null,{"$f":"IF(NOT(ISBLANK(テーブル6[[#This Row],[土木一式]])),VLOOKUP(テーブル6[[#This Row],[土木一式]],土木[],2,TRUE), IF(NOT(ISBLANK(テーブル6[[#This Row],[許可区分(土木)]])),\"D\",\"-\"))","v":"-"},{"$f":"IF(NOT(ISBLANK(テーブル6[[#This Row],[建築一式]])),VLOOKUP(テーブル6[[#This Row],[建築一式]],建築[],2,TRUE), IF(NOT(ISBLANK(テーブル6[[#This Row],[許可区分（建築）]])),\"D\",\"-\"))","v":"-"},{"$f":"IF(NOT(ISBLANK(テーブル6[[#This Row],[電気]])),VLOOKUP(テーブル6[[#This Row],[電気]],電気[],2,TRUE), IF(NOT(ISBLANK(テーブル6[[#This Row],[許可区分（電気）]])),\"D\",\"-\"))","v":"-"},{"$f":"IF(NOT(ISBLANK(テーブル6[[#This Row],[管]])),VLOOKUP(テーブル6[[#This Row],[管]],管[],2,TRUE), IF(NOT(ISBLANK(テーブル6[[#This Row],[許可区分（管）]])),\"D\",\"-\"))","v":"D"},{"$f":"IF(NOT(ISBLANK(テーブル6[[#This Row],[ほ装]])),VLOOKUP(テーブル6[[#This Row],[ほ装]],ほ装[],2,TRUE), IF(NOT(ISBLANK(テーブル6[[#This Row],[許可区分(ほ装)]])),\"D\",\"-\"))","v":"-"},{"$f":"IF(NOT(ISBLANK(テーブル6[[#This Row],[塗装]])),VLOOKUP(テーブル6[[#This Row],[塗装]],塗装[],2,TRUE), IF(NOT(ISBLANK(テーブル6[[#This Row],[許可区分（塗装）]])),\"D\",\"-\"))","v":"-"},{"$f":"IF(NOT(ISBLANK(テーブル6[[#This Row],[防水]])),VLOOKUP(テーブル6[[#This Row],[防水]],塗装[],2,TRUE), IF(NOT(ISBLANK(テーブル6[[#This Row],[許可区分（防水）]])),\"D\",\"-\"))","v":"-"},{"$f":"IF(NOT(ISBLANK(テーブル6[[#This Row],[機械器具設置]])),VLOOKUP(テーブル6[[#This Row],[機械器具設置]],塗装[],2,TRUE), IF(NOT(ISBLANK(テーブル6[[#This Row],[許可区分（機械器具）]])),\"D\",\"-\"))","v":"-"},{"$f":"IF(NOT(ISBLANK(テーブル6[[#This Row],[電気通信]])),VLOOKUP(テーブル6[[#This Row],[電気通信]],電気[],2,TRUE), IF(NOT(ISBLANK(テーブル6[[#This Row],[許可区分(電気)]])),\"D\",\"-\"))","v":"-"},{"$f":"IF(NOT(ISBLANK(テーブル6[[#This Row],[水道施設]])),VLOOKUP(テーブル6[[#This Row],[水道施設]],水道[],2,TRUE), IF(NOT(ISBLANK(テーブル6[[#This Row],[許可区分（水道施設）]])),\"D\",\"-\"))","v":"-"}]
[27,"管内","㈱山清","匝瑳市堀ノ内318-3","勝股　隆雄","0479-74-1222","0479-74-1223","一般",854,null,null,null,null,null,null,"一般",751,null,null,null,null,null,null,null,null,null,null,{"$f":"IF(NOT(ISBLANK(テーブル6[[#This Row],[土木一式]])),VLOOKUP(テーブル6[[#This Row],[土木一式]],土木[],2,TRUE), IF(NOT(ISBLANK(テーブル6[[#This Row],[許可区分(土木)]])),\"D\",\"-\"))","v":"A"},{"$f":"IF(NOT(ISBLANK(テーブル6[[#This Row],[建築一式]])),VLOOKUP(テーブル6[[#This Row],[建築一式]],建築[],2,TRUE), IF(NOT(ISBLANK(テーブル6[[#This Row],[許可区分（建築）]])),\"D\",\"-\"))","v":"-"},{"$f":"IF(NOT(ISBLANK(テーブル6[[#This Row],[電気]])),VLOOKUP(テーブル6[[#This Row],[電気]],電気[],2,TRUE), IF(NOT(ISBLANK(テーブル6[[#This Row],[許可区分（電気）]])),\"D\",\"-\"))","v":"-"},{"$f":"IF(NOT(ISBLANK(テーブル6[[#This Row],[管]])),VLOOKUP(テーブル6[[#This Row],[管]],管[],2,TRUE), IF(NOT(ISBLANK(テーブル6[[#This Row],[許可区分（管）]])),\"D\",\"-\"))","v":"-"},{"$f":"IF(NOT(ISBLANK(テーブル6[[#This Row],[ほ装]])),VLOOKUP(テーブル6[[#This Row],[ほ装]],ほ装[],2,TRUE), IF(NOT(ISBLANK(テーブル6[[#This Row],[許可区分(ほ装)]])),\"D\",\"-\"))","v":"A"},{"$f":"IF(NOT(ISBLANK(テーブル6[[#This Row],[塗装]])),VLOOKUP(テーブル6[[#This Row],[塗装]],塗装[],2,TRUE), IF(NOT(ISBLANK(テーブル6[[#This Row],[許可区分（塗装）]])),\"D\",\"-\"))","v":"-"},{"$f":"IF(NOT(ISBLANK(テーブル6[[#This Row],[防水]])),VLOOKUP(テーブル6[[#This Row],[防水]],塗装[],2,TRUE), IF(NOT(ISBLANK(テーブル6[[#This Row],[許可区分（防水）]])),\"D\",\"-\"))","v":"-"},{"$f":"IF(NOT(ISBLANK(テーブル6[[#This Row],[機械器具設置]])),VLOOKUP(テーブル6[[#This Row],[機械器具設置]],塗装[],2,TRUE), IF(NOT(ISBLANK(テーブル6[[#This Row],[許可区分（機械器具）]])),\"D\",\"-\"))","v":"-"},{"$f":"IF(NOT(ISBLANK(テーブル6[[#This Row],[電気通信]])),VLOOKUP(テーブル6[[#This Row],[電気通信]],電気[],2,TRUE), IF(NOT(ISBLANK(テーブル6[[#This Row],[許可区分(電気)]])),\"D\",\"-\"))","v":"-"},{"$f":"IF(NOT(ISBLANK(テーブル6[[#This Row],[水道施設]])),VLOOKUP(テーブル6[[#This Row],[水道施設]],水道[],2,TRUE), IF(NOT(ISBLANK(テーブル6[[#This Row],[許可区分（水道施設）]])),\"D\",\"-\"))","v":"-"}]
[28,"管内","本田ポンプ店","匝瑳市八日市場イ2318","本田　志夫","0479-72-2571","0479-73-6271","一般",null,null,null,null,null,"一般",null,null,null,null,null,null,null,null,null,null,null,null,null,{"$f":"IF(NOT(ISBLANK(テーブル6[[#This Row],[土木一式]])),VLOOKUP(テーブル6[[#This Row],[土木一式]],土木[],2,TRUE), IF(NOT(ISBLANK(テーブル6[[#This Row],[許可区分(土木)]])),\"D\",\"-\"))","v":"D"},{"$f":"IF(NOT(ISBLANK(テーブル6[[#This Row],[建築一式]])),VLOOKUP(テーブル6[[#This Row],[建築一式]],建築[],2,TRUE), IF(NOT(ISBLANK(テーブル6[[#This Row],[許可区分（建築）]])),\"D\",\"-\"))","v":"-"},{"$f":"IF(NOT(ISBLANK(テーブル6[[#This Row],[電気]])),VLOOKUP(テーブル6[[#This Row],[電気]],電気[],2,TRUE), IF(NOT(ISBLANK(テーブル6[[#This Row],[許可区分（電気）]])),\"D\",\"-\"))","v":"-"},{"$f":"IF(NOT(ISBLANK(テーブル6[[#This Row],[管]])),VLOOKUP(テーブル6[[#This Row],[管]],管[],2,TRUE), IF(NOT(ISBLANK(テーブル6[[#This Row],[許可区分（管）]])),\"D\",\"-\"))","v":"D"},{"$f":"IF(NOT(ISBLANK(テーブル6[[#This Row],[ほ装]])),VLOOKUP(テーブル6[[#This Row],[ほ装]],ほ装[],2,TRUE), IF(NOT(ISBLANK(テーブル6[[#This Row],[許可区分(ほ装)]])),\"D\",\"-\"))","v":"-"},{"$f":"IF(NOT(ISBLANK(テーブル6[[#This Row],[塗装]])),VLOOKUP(テーブル6[[#This Row],[塗装]],塗装[],2,TRUE), IF(NOT(ISBLANK(テーブル6[[#This Row],[許可区分（塗装）]])),\"D\",\"-\"))","v":"-"},{"$f":"IF(NOT(ISBLANK(テーブル6[[#This Row],[防水]])),VLOOKUP(テーブル6[[#This Row],[防水]],塗装[],2,TRUE), IF(NOT(ISBLANK(テーブル6[[#This Row],[許可区分（防水）]])),\"D\",\"-\"))","v":"-"},{"$f":"IF(NOT(ISBLANK(テーブル6[[#This Row],[機械器具設置]])),VLOOKUP(テーブル6[[#This Row],[機械器具設置]],塗装[],2,TRUE), IF(NOT(ISBLANK(テーブル6[[#This Row],[許可区分（機械器具）]])),\"D\",\"-\"))","v":"-"},{"$f":"IF(NOT(ISBLANK(テーブル6[[#This Row],[電気通信]])),VLOOKUP(テーブル6[[#This Row],[電気通信]],電気[],2,TRUE), IF(NOT(ISBLANK(テーブル6[[#This Row],[許可区分(電気)]])),\"D\",\"-\"))","v":"-"},{"$f":"IF(NOT(ISBLANK(テーブル6[[#This Row],[水道施設]])),VLOOKUP(テーブル6[[#This Row],[水道施設]],水道[],2,TRUE), IF(NOT(ISBLANK(テーブル6[[#This Row],[許可区分（水道施設）]])),\"D\",\"-\"))","v":"-"}]
[29,"管内","㈱正貴組","匝瑳市飯倉台8-27","林　正樹","0479-73-1783","0479-73-2662","一般",850,null,null,null,null,null,null,"一般",799,null,null,null,null,null,null,null,null,"一般",null,{"$f":"IF(NOT(ISBLANK(テーブル6[[#This Row],[土木一式]])),VLOOKUP(テーブル6[[#This Row],[土木一式]],土木[],2,TRUE), IF(NOT(ISBLANK(テーブル6[[#This Row],[許可区分(土木)]])),\"D\",\"-\"))","v":"A"},{"$f":"IF(NOT(ISBLANK(テーブル6[[#This Row],[建築一式]])),VLOOKUP(テーブル6[[#This Row],[建築一式]],建築[],2,TRUE), IF(NOT(ISBLANK(テーブル6[[#This Row],[許可区分（建築）]])),\"D\",\"-\"))","v":"-"},{"$f":"IF(NOT(ISBLANK(テーブル6[[#This Row],[電気]])),VLOOKUP(テーブル6[[#This Row],[電気]],電気[],2,TRUE), IF(NOT(ISBLANK(テーブル6[[#This Row],[許可区分（電気）]])),\"D\",\"-\"))","v":"-"},{"$f":"IF(NOT(ISBLANK(テーブル6[[#This Row],[管]])),VLOOKUP(テーブル6[[#This Row],[管]],管[],2,TRUE), IF(NOT(ISBLANK(テーブル6[[#This Row],[許可区分（管）]])),\"D\",\"-\"))","v":"-"},{"$f":"IF(NOT(ISBLANK(テーブル6[[#This Row],[ほ装]])),VLOOKUP(テーブル6[[#This Row],[ほ装]],ほ装[],2,TRUE), IF(NOT(ISBLANK(テーブル6[[#This Row],[許可区分(ほ装)]])),\"D\",\"-\"))","v":"A"},{"$f":"IF(NOT(ISBLANK(テーブル6[[#This Row],[塗装]])),VLOOKUP(テーブル6[[#This Row],[塗装]],塗装[],2,TRUE), IF(NOT(ISBLANK(テーブル6[[#This Row],[許可区分（塗装）]])),\"D\",\"-\"))","v":"-"},{"$f":"IF(NOT(ISBLANK(テーブル6[[#This Row],[防水]])),VLOOKUP(テーブル6[[#This Row],[防水]],塗装[],2,TRUE), IF(NOT(ISBLANK(テーブル6[[#This Row],[許可区分（防水）]])),\"D\",\"-\"))","v":"-"},{"$f":"IF(NOT(ISBLANK(テーブル6[[#This Row],[機械器具設置]])),VLOOKUP(テーブル6[[#This Row],[機械器具設置]],塗装[],2,TRUE), IF(NOT(ISBLANK(テーブル6[[#This Row],[許可区分（機械器具）]])),\"D\",\"-\"))","v":"-"},{"$f":"IF(NOT(ISBLANK(テーブル6[[#This Row],[電気通信]])),VLOOKUP(テーブル6[[#This Row],[電気通信]],電気[],2,TRUE), IF(NOT(ISBLANK(テーブル6[[#This Row],[許可区分(電気)]])),\"D\",\"-\"))","v":"-"},{"$f":"IF(NOT(ISBLANK(テーブル6[[#This Row],[水道施設]])),VLOOKUP(テーブル6[[#This Row],[水道施設]],水道[],2,TRUE), IF(NOT(ISBLANK(テーブル6[[#This Row],[許可区分（水道施設）]])),\"D\",\"-\"))","v":"D"}]
[30,"管内","木村屋金物建材㈱","匝瑳市八日市場イ2585","江波戸　正雄","0479-73-7122","0479-73-7123",null,null,null,null,null,null,null,null,null,null,null,null,null,null,null,null,null,null,null,null,{"$f":"IF(NOT(ISBLANK(テーブル6[[#This Row],[土木一式]])),VLOOKUP(テーブル6[[#This Row],[土木一式]],土木[],2,TRUE), IF(NOT(ISBLANK(テーブル6[[#This Row],[許可区分(土木)]])),\"D\",\"-\"))","v":"-"},{"$f":"IF(NOT(ISBLANK(テーブル6[[#This Row],[建築一式]])),VLOOKUP(テーブル6[[#This Row],[建築一式]],建築[],2,TRUE), IF(NOT(ISBLANK(テーブル6[[#This Row],[許可区分（建築）]])),\"D\",\"-\"))","v":"-"},{"$f":"IF(NOT(ISBLANK(テーブル6[[#This Row],[電気]])),VLOOKUP(テーブル6[[#This Row],[電気]],電気[],2,TRUE), IF(NOT(ISBLANK(テーブル6[[#This Row],[許可区分（電気）]])),\"D\",\"-\"))","v":"-"},{"$f":"IF(NOT(ISBLANK(テーブル6[[#This Row],[管]])),VLOOKUP(テーブル6[[#This Row],[管]],管[],2,TRUE), IF(NOT(ISBLANK(テーブル6[[#This Row],[許可区分（管）]])),\"D\",\"-\"))","v":"-"},{"$f":"IF(NOT(ISBLANK(テーブル6[[#This Row],[ほ装]])),VLOOKUP(テーブル6[[#This Row],[ほ装]],ほ装[],2,TRUE), IF(NOT(ISBLANK(テーブル6[[#This Row],[許可区分(ほ装)]])),\"D\",\"-\"))","v":"-"},{"$f":"IF(NOT(ISBLANK(テーブル6[[#This Row],[塗装]])),VLOOKUP(テーブル6[[#This Row],[塗装]],塗装[],2,TRUE), IF(NOT(ISBLANK(テーブル6[[#This Row],[許可区分（塗装）]])),\"D\",\"-\"))","v":"-"},{"$f":"IF(NOT(ISBLANK(テーブル6[[#This Row],[防水]])),VLOOKUP(テーブル6[[#This Row],[防水]],塗装[],2,TRUE), IF(NOT(ISBLANK(テーブル6[[#This Row],[許可区分（防水）]])),\"D\",\"-\"))","v":"-"},{"$f":"IF(NOT(ISBLANK(テーブル6[[#This Row],[機械器具設置]])),VLOOKUP(テーブル6[[#This Row],[機械器具設置]],塗装[],2,TRUE), IF(NOT(ISBLANK(テーブル6[[#This Row],[許可区分（機械器具）]])),\"D\",\"-\"))","v":"-"},{"$f":"IF(NOT(ISBLANK(テーブル6[[#This Row],[電気通信]])),VLOOKUP(テーブル6[[#This Row],[電気通信]],電気[],2,TRUE), IF(NOT(ISBLANK(テーブル6[[#This Row],[許可区分(電気)]])),\"D\",\"-\"))","v":"-"},{"$f":"IF(NOT(ISBLANK(テーブル6[[#This Row],[水道施設]])),VLOOKUP(テーブル6[[#This Row],[水道施設]],水道[],2,TRUE), IF(NOT(ISBLANK(テーブル6[[#This Row],[許可区分（水道施設）]])),\"D\",\"-\"))","v":"-"},"建築"]
[31,"管内","㈱鈴木組","匝瑳市栢田7952-69","土屋　昌利","0479-67-2075","0479-67-5215","特定",860,null,null,null,null,null,null,"特定",812,null,null,null,null,null,null,null,null,"特定",775,{"$f":"IF(NOT(ISBLANK(テーブル6[[#This Row],[土木一式]])),VLOOKUP(テーブル6[[#This Row],[土木一式]],土木[],2,TRUE), IF(NOT(ISBLANK(テーブル6[[#This Row],[許可区分(土木)]])),\"D\",\"-\"))","v":"A"},{"$f":"IF(NOT(ISBLANK(テーブル6[[#This Row],[建築一式]])),VLOOKUP(テーブル6[[#This Row],[建築一式]],建築[],2,TRUE), IF(NOT(ISBLANK(テーブル6[[#This Row],[許可区分（建築）]])),\"D\",\"-\"))","v":"-"},{"$f":"IF(NOT(ISBLANK(テーブル6[[#This Row],[電気]])),VLOOKUP(テーブル6[[#This Row],[電気]],電気[],2,TRUE), IF(NOT(ISBLANK(テーブル6[[#This Row],[許可区分（電気）]])),\"D\",\"-\"))","v":"-"},{"$f":"IF(NOT(ISBLANK(テーブル6[[#This Row],[管]])),VLOOKUP(テーブル6[[#This Row],[管]],管[],2,TRUE), IF(NOT(ISBLANK(テーブル6[[#This Row],[許可区分（管）]])),\"D\",\"-\"))","v":"-"},0,0,{"$f":"IF(NOT(ISBLANK(テーブル6[[#This Row],[防水]])),VLOOKUP(テーブル6[[#This Row],[防水]],塗装[],2,TRUE), IF(NOT(ISBLANK(テーブル6[[#This Row],[許可区分（防水）]])),\"D\",\"-\"))","v":"-"},{"$f":"IF(NOT(ISBLANK(テーブル6[[#This Row],[機械器具設置]])),VLOOKUP(テーブル6[[#This Row],[機械器具設置]],塗装[],2,TRUE), IF(NOT(ISBLANK(テーブル6[[#This Row],[許可区分（機械器具）]])),\"D\",\"-\"))","v":"-"},{"$f":"IF(NOT(ISBLANK(テーブル6[[#This Row],[電気通信]])),VLOOKUP(テーブル6[[#This Row],[電気通信]],電気[],2,TRUE), IF(NOT(ISBLANK(テーブル6[[#This Row],[許可区分(電気)]])),\"D\",\"-\"))","v":"-"},{"$f":"IF(NOT(ISBLANK(テーブル6[[#This Row],[水道施設]])),VLOOKUP(テーブル6[[#This Row],[水道施設]],水道[],2,TRUE), IF(NOT(ISBLANK(テーブル6[[#This Row],[許可区分（水道施設）]])),\"D\",\"-\"))","v":"B"}]
[32,"管内","㈲椎名土木","匝瑳市堀川3624","椎名　利臣","0479-67-1578","0479-67-1579","特定",821,null,null,null,null,null,null,"特定",712,null,null,null,null,null,null,null,null,"特定",659,{"$f":"IF(NOT(ISBLANK(テーブル6[[#This Row],[土木一式]])),VLOOKUP(テーブル6[[#This Row],[土木一式]],土木[],2,TRUE), IF(NOT(ISBLANK(テーブル6[[#This Row],[許可区分(土木)]])),\"D\",\"-\"))","v":"A"},{"$f":"IF(NOT(ISBLANK(テーブル6[[#This Row],[建築一式]])),VLOOKUP(テーブル6[[#This Row],[建築一式]],建築[],2,TRUE), IF(NOT(ISBLANK(テーブル6[[#This Row],[許可区分（建築）]])),\"D\",\"-\"))","v":"-"},{"$f":"IF(NOT(ISBLANK(テーブル6[[#This Row],[電気]])),VLOOKUP(テーブル6[[#This Row],[電気]],電気[],2,TRUE), IF(NOT(ISBLANK(テーブル6[[#This Row],[許可区分（電気）]])),\"D\",\"-\"))","v":"-"},{"$f":"IF(NOT(ISBLANK(テーブル6[[#This Row],[管]])),VLOOKUP(テーブル6[[#This Row],[管]],管[],2,TRUE), IF(NOT(ISBLANK(テーブル6[[#This Row],[許可区分（管）]])),\"D\",\"-\"))","v":"-"},{"$f":"IF(NOT(ISBLANK(テーブル6[[#This Row],[ほ装]])),VLOOKUP(テーブル6[[#This Row],[ほ装]],ほ装[],2,TRUE), IF(NOT(ISBLANK(テーブル6[[#This Row],[許可区分(ほ装)]])),\"D\",\"-\"))","v":"A"},{"$f":"IF(NOT(ISBLANK(テーブル6[[#This Row],[塗装]])),VLOOKUP(テーブル6[[#This Row],[塗装]],塗装[],2,TRUE), IF(NOT(ISBLANK(テーブル6[[#This Row],[許可区分（塗装）]])),\"D\",\"-\"))","v":"-"},{"$f":"IF(NOT(ISBLANK(テーブル6[[#This Row],[防水]])),VLOOKUP(テーブル6[[#This Row],[防水]],塗装[],2,TRUE), IF(NOT(ISBLANK(テーブル6[[#This Row],[許可区分（防水）]])),\"D\",\"-\"))","v":"-"},{"$f":"IF(NOT(ISBLANK(テーブル6[[#This Row],[機械器具設置]])),VLOOKUP(テーブル6[[#This Row],[機械器具設置]],塗装[],2,TRUE), IF(NOT(ISBLANK(テーブル6[[#This Row],[許可区分（機械器具）]])),\"D\",\"-\"))","v":"-"},{"$f":"IF(NOT(ISBLANK(テーブル6[[#This Row],[電気通信]])),VLOOKUP(テーブル6[[#This Row],[電気通信]],電気[],2,TRUE), IF(NOT(ISBLANK(テーブル6[[#This Row],[許可区分(電気)]])),\"D\",\"-\"))","v":"-"},{"$f":"IF(NOT(ISBLANK(テーブル6[[#This Row],[水道施設]])),VLOOKUP(テーブル6[[#This Row],[水道施設]],水道[],2,TRUE), IF(NOT(ISBLANK(テーブル6[[#This Row],[許可区分（水道施設）]])),\"D\",\"-\"))","v":"C"}]
[33,"管内","片岡建設㈱","匝瑳市飯倉284","片岡　鉄也","0479-72-2585","0479-73-6882","特定",979,null,null,null,null,null,null,"特定",893,null,null,null,null,null,null,null,null,null,null,{"$f":"IF(NOT(ISBLANK(テーブル6[[#This Row],[土木一式]])),VLOOKUP(テーブル6[[#This Row],[土木一式]],土木[],2,TRUE), IF(NOT(ISBLANK(テーブル6[[#This Row],[許可区分(土木)]])),\"D\",\"-\"))","v":"A"},{"$f":"IF(NOT(ISBLANK(テーブル6[[#This Row],[建築一式]])),VLOOKUP(テーブル6[[#This Row],[建築一式]],建築[],2,TRUE), IF(NOT(ISBLANK(テーブル6[[#This Row],[許可区分（建築）]])),\"D\",\"-\"))","v":"-"},{"$f":"IF(NOT(ISBLANK(テーブル6[[#This Row],[電気]])),VLOOKUP(テーブル6[[#This Row],[電気]],電気[],2,TRUE), IF(NOT(ISBLANK(テーブル6[[#This Row],[許可区分（電気）]])),\"D\",\"-\"))","v":"-"},{"$f":"IF(NOT(ISBLANK(テーブル6[[#This Row],[管]])),VLOOKUP(テーブル6[[#This Row],[管]],管[],2,TRUE), IF(NOT(ISBLANK(テーブル6[[#This Row],[許可区分（管）]])),\"D\",\"-\"))","v":"-"},{"$f":"IF(NOT(ISBLANK(テーブル6[[#This Row],[ほ装]])),VLOOKUP(テーブル6[[#This Row],[ほ装]],ほ装[],2,TRUE), IF(NOT(ISBLANK(テーブル6[[#This Row],[許可区分(ほ装)]])),\"D\",\"-\"))","v":"A"},{"$f":"IF(NOT(ISBLANK(テーブル6[[#This Row],[塗装]])),VLOOKUP(テーブル6[[#This Row],[塗装]],塗装[],2,TRUE), IF(NOT(ISBLANK(テーブル6[[#This Row],[許可区分（塗装）]])),\"D\",\"-\"))","v":"-"},{"$f":"IF(NOT(ISBLANK(テーブル6[[#This Row],[防水]])),VLOOKUP(テーブル6[[#This Row],[防水]],塗装[],2,TRUE), IF(NOT(ISBLANK(テーブル6[[#This Row],[許可区分（防水）]])),\"D\",\"-\"))","v":"-"},{"$f":"IF(NOT(ISBLANK(テーブル6[[#This Row],[機械器具設置]])),VLOOKUP(テーブル6[[#This Row],[機械器具設置]],塗装[],2,TRUE), IF(NOT(ISBLANK(テーブル6[[#This Row],[許可区分（機械器具）]])),\"D\",\"-\"))","v":"-"},{"$f":"IF(NOT(ISBLANK(テーブル6[[#This Row],[電気通信]])),VLOOKUP(テーブル6[[#This Row],[電気通信]],電気[],2,TRUE), IF(NOT(ISBLANK(テーブル6[[#This Row],[許可区分(電気)]])),\"D\",\"-\"))","v":"-"},{"$f":"IF(NOT(ISBLANK(テーブル6[[#This Row],[水道施設]])),VLOOKUP(テーブル6[[#This Row],[水道施設]],水道[],2,TRUE), IF(NOT(ISBLANK(テーブル6[[#This Row],[許可区分（水道施設）]])),\"D\",\"-\"))","v":"-"}]
[34,"管内","㈲秋葉設備","匝瑳市野手16925","秋葉　浩","0479-67-2849","0479-67-2852",null,null,null,null,null,null,"一般",null,null,null,null,null,null,null,null,null,null,null,null,null,{"$f":"IF(NOT(ISBLANK(テーブル6[[#This Row],[土木一式]])),VLOOKUP(テーブル6[[#This Row],[土木一式]],土木[],2,TRUE), IF(NOT(ISBLANK(テーブル6[[#This Row],[許可区分(土木)]])),\"D\",\"-\"))","v":"-"},{"$f":"IF(NOT(ISBLANK(テーブル6[[#This Row],[建築一式]])),VLOOKUP(テーブル6[[#This Row],[建築一式]],建築[],2,TRUE), IF(NOT(ISBLANK(テーブル6[[#This Row],[許可区分（建築）]])),\"D\",\"-\"))","v":"-"},{"$f":"IF(NOT(ISBLANK(テーブル6[[#This Row],[電気]])),VLOOKUP(テーブル6[[#This Row],[電気]],電気[],2,TRUE), IF(NOT(ISBLANK(テーブル6[[#This Row],[許可区分（電気）]])),\"D\",\"-\"))","v":"-"},{"$f":"IF(NOT(ISBLANK(テーブル6[[#This Row],[管]])),VLOOKUP(テーブル6[[#This Row],[管]],管[],2,TRUE), IF(NOT(ISBLANK(テーブル6[[#This Row],[許可区分（管）]])),\"D\",\"-\"))","v":"D"},{"$f":"IF(NOT(ISBLANK(テーブル6[[#This Row],[ほ装]])),VLOOKUP(テーブル6[[#This Row],[ほ装]],ほ装[],2,TRUE), IF(NOT(ISBLANK(テーブル6[[#This Row],[許可区分(ほ装)]])),\"D\",\"-\"))","v":"-"},{"$f":"IF(NOT(ISBLANK(テーブル6[[#This Row],[塗装]])),VLOOKUP(テーブル6[[#This Row],[塗装]],塗装[],2,TRUE), IF(NOT(ISBLANK(テーブル6[[#This Row],[許可区分（塗装）]])),\"D\",\"-\"))","v":"-"},{"$f":"IF(NOT(ISBLANK(テーブル6[[#This Row],[防水]])),VLOOKUP(テーブル6[[#This Row],[防水]],塗装[],2,TRUE), IF(NOT(ISBLANK(テーブル6[[#This Row],[許可区分（防水）]])),\"D\",\"-\"))","v":"-"},{"$f":"IF(NOT(ISBLANK(テーブル6[[#This Row],[機械器具設置]])),VLOOKUP(テーブル6[[#This Row],[機械器具設置]],塗装[],2,TRUE), IF(NOT(ISBLANK(テーブル6[[#This Row],[許可区分（機械器具）]])),\"D\",\"-\"))","v":"-"},{"$f":"IF(NOT(ISBLANK(テーブル6[[#This Row],[電気通信]])),VLOOKUP(テーブル6[[#This Row],[電気通信]],電気[],2,TRUE), IF(NOT(ISBLANK(テーブル6[[#This Row],[許可区分(電気)]])),\"D\",\"-\"))","v":"-"},{"$f":"IF(NOT(ISBLANK(テーブル6[[#This Row],[水道施設]])),VLOOKUP(テーブル6[[#This Row],[水道施設]],水道[],2,TRUE), IF(NOT(ISBLANK(テーブル6[[#This Row],[許可区分（水道施設）]])),\"D\",\"-\"))","v":"-"}]
[35,"管内","オヨカワ設備工業","匝瑳市平木7886-1","及川　健蔵","0479-79-2707","0479-79-2707",null,null,null,null,null,null,"一般",null,null,null,null,null,null,null,null,null,null,null,null,null,{"$f":"IF(NOT(ISBLANK(テーブル6[[#This Row],[土木一式]])),VLOOKUP(テーブル6[[#This Row],[土木一式]],土木[],2,TRUE), IF(NOT(ISBLANK(テーブル6[[#This Row],[許可区分(土木)]])),\"D\",\"-\"))","v":"-"},{"$f":"IF(NOT(ISBLANK(テーブル6[[#This Row],[建築一式]])),VLOOKUP(テーブル6[[#This Row],[建築一式]],建築[],2,TRUE), IF(NOT(ISBLANK(テーブル6[[#This Row],[許可区分（建築）]])),\"D\",\"-\"))","v":"-"},{"$f":"IF(NOT(ISBLANK(テーブル6[[#This Row],[電気]])),VLOOKUP(テーブル6[[#This Row],[電気]],電気[],2,TRUE), IF(NOT(ISBLANK(テーブル6[[#This Row],[許可区分（電気）]])),\"D\",\"-\"))","v":"-"},{"$f":"IF(NOT(ISBLANK(テーブル6[[#This Row],[管]])),VLOOKUP(テーブル6[[#This Row],[管]],管[],2,TRUE), IF(NOT(ISBLANK(テーブル6[[#This Row],[許可区分（管）]])),\"D\",\"-\"))","v":"D"},{"$f":"IF(NOT(ISBLANK(テーブル6[[#This Row],[ほ装]])),VLOOKUP(テーブル6[[#This Row],[ほ装]],ほ装[],2,TRUE), IF(NOT(ISBLANK(テーブル6[[#This Row],[許可区分(ほ装)]])),\"D\",\"-\"))","v":"-"},{"$f":"IF(NOT(ISBLANK(テーブル6[[#This Row],[塗装]])),VLOOKUP(テーブル6[[#This Row],[塗装]],塗装[],2,TRUE), IF(NOT(ISBLANK(テーブル6[[#This Row],[許可区分（塗装）]])),\"D\",\"-\"))","v":"-"},{"$f":"IF(NOT(ISBLANK(テーブル6[[#This Row],[防水]])),VLOOKUP(テーブル6[[#This Row],[防水]],塗装[],2,TRUE), IF(NOT(ISBLANK(テーブル6[[#This Row],[許可区分（防水）]])),\"D\",\"-\"))","v":"-"},{"$f":"IF(NOT(ISBLANK(テーブル6[[#This Row],[機械器具設置]])),VLOOKUP(テーブル6[[#This Row],[機械器具設置]],塗装[],2,TRUE), IF(NOT(ISBLANK(テーブル6[[#This Row],[許可区分（機械器具）]])),\"D\",\"-\"))","v":"-"},{"$f":"IF(NOT(ISBLANK(テーブル6[[#This Row],[電気通信]])),VLOOKUP(テーブル6[[#This Row],[電気通信]],電気[],2,TRUE), IF(NOT(ISBLANK(テーブル6[[#This Row],[許可区分(電気)]])),\"D\",\"-\"))","v":"-"},{"$f":"IF(NOT(ISBLANK(テーブル6[[#This Row],[水道施設]])),VLOOKUP(テーブル6[[#This Row],[水道施設]],水道[],2,TRUE), IF(NOT(ISBLANK(テーブル6[[#This Row],[許可区分（水道施設）]])),\"D\",\"-\"))","v":"-"}]
[36,"管内","㈱渡邉電気","匝瑳市若潮町21-4","渡邉　順一","0479-73-5838","0479-73-5878",null,null,null,null,"一般",582,null,null,null,null,null,null,null,null,null,null,null,null,null,null,{"$f":"IF(NOT(ISBLANK(テーブル6[[#This Row],[土木一式]])),VLOOKUP(テーブル6[[#This Row],[土木一式]],土木[],2,TRUE), IF(NOT(ISBLANK(テーブル6[[#This Row],[許可区分(土木)]])),\"D\",\"-\"))","v":"-"},{"$f":"IF(NOT(ISBLANK(テーブル6[[#This Row],[建築一式]])),VLOOKUP(テーブル6[[#This Row],[建築一式]],建築[],2,TRUE), IF(NOT(ISBLANK(テーブル6[[#This Row],[許可区分（建築）]])),\"D\",\"-\"))","v":"-"},{"$f":"IF(NOT(ISBLANK(テーブル6[[#This Row],[電気]])),VLOOKUP(テーブル6[[#This Row],[電気]],電気[],2,TRUE), IF(NOT(ISBLANK(テーブル6[[#This Row],[許可区分（電気）]])),\"D\",\"-\"))","v":"D"},{"$f":"IF(NOT(ISBLANK(テーブル6[[#This Row],[管]])),VLOOKUP(テーブル6[[#This Row],[管]],管[],2,TRUE), IF(NOT(ISBLANK(テーブル6[[#This Row],[許可区分（管）]])),\"D\",\"-\"))","v":"-"},{"$f":"IF(NOT(ISBLANK(テーブル6[[#This Row],[ほ装]])),VLOOKUP(テーブル6[[#This Row],[ほ装]],ほ装[],2,TRUE), IF(NOT(ISBLANK(テーブル6[[#This Row],[許可区分(ほ装)]])),\"D\",\"-\"))","v":"-"},{"$f":"IF(NOT(ISBLANK(テーブル6[[#This Row],[塗装]])),VLOOKUP(テーブル6[[#This Row],[塗装]],塗装[],2,TRUE), IF(NOT(ISBLANK(テーブル6[[#This Row],[許可区分（塗装）]])),\"D\",\"-\"))","v":"-"},{"$f":"IF(NOT(ISBLANK(テーブル6[[#This Row],[防水]])),VLOOKUP(テーブル6[[#This Row],[防水]],塗装[],2,TRUE), IF(NOT(ISBLANK(テーブル6[[#This Row],[許可区分（防水）]])),\"D\",\"-\"))","v":"-"},{"$f":"IF(NOT(ISBLANK(テーブル6[[#This Row],[機械器具設置]])),VLOOKUP(テーブル6[[#This Row],[機械器具設置]],塗装[],2,TRUE), IF(NOT(ISBLANK(テーブル6[[#This Row],[許可区分（機械器具）]])),\"D\",\"-\"))","v":"-"},{"$f":"IF(NOT(ISBLANK(テーブル6[[#This Row],[電気通信]])),VLOOKUP(テーブル6[[#This Row],[電気通信]],電気[],2,TRUE), IF(NOT(ISBLANK(テーブル6[[#This Row],[許可区分(電気)]])),\"D\",\"-\"))","v":"-"},{"$f":"IF(NOT(ISBLANK(テーブル6[[#This Row],[水道施設]])),VLOOKUP(テーブル6[[#This Row],[水道施設]],水道[],2,TRUE), IF(NOT(ISBLANK(テーブル6[[#This Row],[許可区分（水道施設）]])),\"D\",\"-\"))","v":"-"}]
[37,"管内","植忠造園土木㈱　八日市場営業所","匝瑳市上谷中2-3","吉野　武彦","0479-73-5601","0479-74-3720","一般",810,null,null,null,null,null,null,"一般",702,null,null,null,null,null,null,null,null,null,null,{"$f":"IF(NOT(ISBLANK(テーブル6[[#This Row],[土木一式]])),VLOOKUP(テーブル6[[#This Row],[土木一式]],土木[],2,TRUE), IF(NOT(ISBLANK(テーブル6[[#This Row],[許可区分(土木)]])),\"D\",\"-\"))","v":"A"},{"$f":"IF(NOT(ISBLANK(テーブル6[[#This Row],[建築一式]])),VLOOKUP(テーブル6[[#This Row],[建築一式]],建築[],2,TRUE), IF(NOT(ISBLANK(テーブル6[[#This Row],[許可区分（建築）]])),\"D\",\"-\"))","v":"-"},{"$f":"IF(NOT(ISBLANK(テーブル6[[#This Row],[電気]])),VLOOKUP(テーブル6[[#This Row],[電気]],電気[],2,TRUE), IF(NOT(ISBLANK(テーブル6[[#This Row],[許可区分（電気）]])),\"D\",\"-\"))","v":"-"},{"$f":"IF(NOT(ISBLANK(テーブル6[[#This Row],[管]])),VLOOKUP(テーブル6[[#This Row],[管]],管[],2,TRUE), IF(NOT(ISBLANK(テーブル6[[#This Row],[許可区分（管）]])),\"D\",\"-\"))","v":"-"},{"$f":"IF(NOT(ISBLANK(テーブル6[[#This Row],[ほ装]])),VLOOKUP(テーブル6[[#This Row],[ほ装]],ほ装[],2,TRUE), IF(NOT(ISBLANK(テーブル6[[#This Row],[許可区分(ほ装)]])),\"D\",\"-\"))","v":"A"},{"$f":"IF(NOT(ISBLANK(テーブル6[[#This Row],[塗装]])),VLOOKUP(テーブル6[[#This Row],[塗装]],塗装[],2,TRUE), IF(NOT(ISBLANK(テーブル6[[#This Row],[許可区分（塗装）]])),\"D\",\"-\"))","v":"-"},{"$f":"IF(NOT(ISBLANK(テーブル6[[#This Row],[防水]])),VLOOKUP(テーブル6[[#This Row],[防水]],塗装[],2,TRUE), IF(NOT(ISBLANK(テーブル6[[#This Row],[許可区分（防水）]])),\"D\",\"-\"))","v":"-"},{"$f":"IF(NOT(ISBLANK(テーブル6[[#This Row],[機械器具設置]])),VLOOKUP(テーブル6[[#This Row],[機械器具設置]],塗装[],2,TRUE), IF(NOT(ISBLANK(テーブル6[[#This Row],[許可区分（機械器具）]])),\"D\",\"-\"))","v":"-"},{"$f":"IF(NOT(ISBLANK(テーブル6[[#This Row],[電気通信]])),VLOOKUP(テーブル6[[#This Row],[電気通信]],電気[],2,TRUE), IF(NOT(ISBLANK(テーブル6[[#This Row],[許可区分(電気)]])),\"D\",\"-\"))","v":"-"},{"$f":"IF(NOT(ISBLANK(テーブル6[[#This Row],[水道施設]])),VLOOKUP(テーブル6[[#This Row],[水道施設]],水道[],2,TRUE), IF(NOT(ISBLANK(テーブル6[[#This Row],[許可区分（水道施設）]])),\"D\",\"-\"))","v":"-"}]
[38,"管内","㈱野﨑水道","山武郡横芝光町宮川6969-16","野﨑　秀竜","0479-80-3450","0479-80-3450","一般",null,null,null,null,null,"一般",null,null,null,null,null,null,null,null,null,null,null,null,null,{"$f":"IF(NOT(ISBLANK(テーブル6[[#This Row],[土木一式]])),VLOOKUP(テーブル6[[#This Row],[土木一式]],土木[],2,TRUE), IF(NOT(ISBLANK(テーブル6[[#This Row],[許可区分(土木)]])),\"D\",\"-\"))","v":"D"},{"$f":"IF(NOT(ISBLANK(テーブル6[[#This Row],[建築一式]])),VLOOKUP(テーブル6[[#This Row],[建築一式]],建築[],2,TRUE), IF(NOT(ISBLANK(テーブル6[[#This Row],[許可区分（建築）]])),\"D\",\"-\"))","v":"-"},{"$f":"IF(NOT(ISBLANK(テーブル6[[#This Row],[電気]])),VLOOKUP(テーブル6[[#This Row],[電気]],電気[],2,TRUE), IF(NOT(ISBLANK(テーブル6[[#This Row],[許可区分（電気）]])),\"D\",\"-\"))","v":"-"},{"$f":"IF(NOT(ISBLANK(テーブル6[[#This Row],[管]])),VLOOKUP(テーブル6[[#This Row],[管]],管[],2,TRUE), IF(NOT(ISBLANK(テーブル6[[#This Row],[許可区分（管）]])),\"D\",\"-\"))","v":"D"},{"$f":"IF(NOT(ISBLANK(テーブル6[[#This Row],[ほ装]])),VLOOKUP(テーブル6[[#This Row],[ほ装]],ほ装[],2,TRUE), IF(NOT(ISBLANK(テーブル6[[#This Row],[許可区分(ほ装)]])),\"D\",\"-\"))","v":"-"},{"$f":"IF(NOT(ISBLANK(テーブル6[[#This Row],[塗装]])),VLOOKUP(テーブル6[[#This Row],[塗装]],塗装[],2,TRUE), IF(NOT(ISBLANK(テーブル6[[#This Row],[許可区分（塗装）]])),\"D\",\"-\"))","v":"-"},{"$f":"IF(NOT(ISBLANK(テーブル6[[#This Row],[防水]])),VLOOKUP(テーブル6[[#This Row],[防水]],塗装[],2,TRUE), IF(NOT(ISBLANK(テーブル6[[#This Row],[許可区分（防水）]])),\"D\",\"-\"))","v":"-"},{"$f":"IF(NOT(ISBLANK(テーブル6[[#This Row],[機械器具設置]])),VLOOKUP(テーブル6[[#This Row],[機械器具設置]],塗装[],2,TRUE), IF(NOT(ISBLANK(テーブル6[[#This Row],[許可区分（機械器具）]])),\"D\",\"-\"))","v":"-"},{"$f":"IF(NOT(ISBLANK(テーブル6[[#This Row],[電気通信]])),VLOOKUP(テーブル6[[#This Row],[電気通信]],電気[],2,TRUE), IF(NOT(ISBLANK(テーブル6[[#This Row],[許可区分(電気)]])),\"D\",\"-\"))","v":"-"},{"$f":"IF(NOT(ISBLANK(テーブル6[[#This Row],[水道施設]])),VLOOKUP(テーブル6[[#This Row],[水道施設]],水道[],2,TRUE), IF(NOT(ISBLANK(テーブル6[[#This Row],[許可区分（水道施設）]])),\"D\",\"-\"))","v":"-"}]
[39,"管内","㈲小川住設","匝瑳市新堀916","小川　好一","0479-67-2364","0479-67-2713","一般",null,null,null,null,null,"一般",null,null,null,null,null,null,null,null,null,null,null,null,null,{"$f":"IF(NOT(ISBLANK(テーブル6[[#This Row],[土木一式]])),VLOOKUP(テーブル6[[#This Row],[土木一式]],土木[],2,TRUE), IF(NOT(ISBLANK(テーブル6[[#This Row],[許可区分(土木)]])),\"D\",\"-\"))","v":"D"},{"$f":"IF(NOT(ISBLANK(テーブル6[[#This Row],[建築一式]])),VLOOKUP(テーブル6[[#This Row],[建築一式]],建築[],2,TRUE), IF(NOT(ISBLANK(テーブル6[[#This Row],[許可区分（建築）]])),\"D\",\"-\"))","v":"-"},{"$f":"IF(NOT(ISBLANK(テーブル6[[#This Row],[電気]])),VLOOKUP(テーブル6[[#This Row],[電気]],電気[],2,TRUE), IF(NOT(ISBLANK(テーブル6[[#This Row],[許可区分（電気）]])),\"D\",\"-\"))","v":"-"},{"$f":"IF(NOT(ISBLANK(テーブル6[[#This Row],[管]])),VLOOKUP(テーブル6[[#This Row],[管]],管[],2,TRUE), IF(NOT(ISBLANK(テーブル6[[#This Row],[許可区分（管）]])),\"D\",\"-\"))","v":"D"},{"$f":"IF(NOT(ISBLANK(テーブル6[[#This Row],[ほ装]])),VLOOKUP(テーブル6[[#This Row],[ほ装]],ほ装[],2,TRUE), IF(NOT(ISBLANK(テーブル6[[#This Row],[許可区分(ほ装)]])),\"D\",\"-\"))","v":"-"},{"$f":"IF(NOT(ISBLANK(テーブル6[[#This Row],[塗装]])),VLOOKUP(テーブル6[[#This Row],[塗装]],塗装[],2,TRUE), IF(NOT(ISBLANK(テーブル6[[#This Row],[許可区分（塗装）]])),\"D\",\"-\"))","v":"-"},{"$f":"IF(NOT(ISBLANK(テーブル6[[#This Row],[防水]])),VLOOKUP(テーブル6[[#This Row],[防水]],塗装[],2,TRUE), IF(NOT(ISBLANK(テーブル6[[#This Row],[許可区分（防水）]])),\"D\",\"-\"))","v":"-"},{"$f":"IF(NOT(ISBLANK(テーブル6[[#This Row],[機械器具設置]])),VLOOKUP(テーブル6[[#This Row],[機械器具設置]],塗装[],2,TRUE), IF(NOT(ISBLANK(テーブル6[[#This Row],[許可区分（機械器具）]])),\"D\",\"-\"))","v":"-"},{"$f":"IF(NOT(ISBLANK(テーブル6[[#This Row],[電気通信]])),VLOOKUP(テーブル6[[#This Row],[電気通信]],電気[],2,TRUE), IF(NOT(ISBLANK(テーブル6[[#This Row],[許可区分(電気)]])),\"D\",\"-\"))","v":"-"},{"$f":"IF(NOT(ISBLANK(テーブル6[[#This Row],[水道施設]])),VLOOKUP(テーブル6[[#This Row],[水道施設]],水道[],2,TRUE), IF(NOT(ISBLANK(テーブル6[[#This Row],[許可区分（水道施設）]])),\"D\",\"-\"))","v":"-"}]
[40,"管外","千葉ノーミ㈱","成田市三里塚光ヶ丘1番349","村井　昭之","0476-37-4075","0476-37-4095",null,null,null,null,null,null,null,null,null,null,null,null,null,null,null,null,null,null,null,null,{"$f":"IF(NOT(ISBLANK(テーブル6[[#This Row],[土木一式]])),VLOOKUP(テーブル6[[#This Row],[土木一式]],土木[],2,TRUE), IF(NOT(ISBLANK(テーブル6[[#This Row],[許可区分(土木)]])),\"D\",\"-\"))","v":"-"},{"$f":"IF(NOT(ISBLANK(テーブル6[[#This Row],[建築一式]])),VLOOKUP(テーブル6[[#This Row],[建築一式]],建築[],2,TRUE), IF(NOT(ISBLANK(テーブル6[[#This Row],[許可区分（建築）]])),\"D\",\"-\"))","v":"-"},{"$f":"IF(NOT(ISBLANK(テーブル6[[#This Row],[電気]])),VLOOKUP(テーブル6[[#This Row],[電気]],電気[],2,TRUE), IF(NOT(ISBLANK(テーブル6[[#This Row],[許可区分（電気）]])),\"D\",\"-\"))","v":"-"},{"$f":"IF(NOT(ISBLANK(テーブル6[[#This Row],[管]])),VLOOKUP(テーブル6[[#This Row],[管]],管[],2,TRUE), IF(NOT(ISBLANK(テーブル6[[#This Row],[許可区分（管）]])),\"D\",\"-\"))","v":"-"},{"$f":"IF(NOT(ISBLANK(テーブル6[[#This Row],[ほ装]])),VLOOKUP(テーブル6[[#This Row],[ほ装]],ほ装[],2,TRUE), IF(NOT(ISBLANK(テーブル6[[#This Row],[許可区分(ほ装)]])),\"D\",\"-\"))","v":"-"},{"$f":"IF(NOT(ISBLANK(テーブル6[[#This Row],[塗装]])),VLOOKUP(テーブル6[[#This Row],[塗装]],塗装[],2,TRUE), IF(NOT(ISBLANK(テーブル6[[#This Row],[許可区分（塗装）]])),\"D\",\"-\"))","v":"-"},{"$f":"IF(NOT(ISBLANK(テーブル6[[#This Row],[防水]])),VLOOKUP(テーブル6[[#This Row],[防水]],塗装[],2,TRUE), IF(NOT(ISBLANK(テーブル6[[#This Row],[許可区分（防水）]])),\"D\",\"-\"))","v":"-"},{"$f":"IF(NOT(ISBLANK(テーブル6[[#This Row],[機械器具設置]])),VLOOKUP(テーブル6[[#This Row],[機械器具設置]],塗装[],2,TRUE), IF(NOT(ISBLANK(テーブル6[[#This Row],[許可区分（機械器具）]])),\"D\",\"-\"))","v":"-"},{"$f":"IF(NOT(ISBLANK(テーブル6[[#This Row],[電気通信]])),VLOOKUP(テーブル6[[#This Row],[電気通信]],電気[],2,TRUE), IF(NOT(ISBLANK(テーブル6[[#This Row],[許可区分(電気)]])),\"D\",\"-\"))","v":"-"},{"$f":"IF(NOT(ISBLANK(テーブル6[[#This Row],[水道施設]])),VLOOKUP(テーブル6[[#This Row],[水道施設]],水道[],2,TRUE), IF(NOT(ISBLANK(テーブル6[[#This Row],[許可区分（水道施設）]])),\"D\",\"-\"))","v":"-"}]
[41,"管外","千葉ノーミ㈱","成田市三里塚光ヶ丘1番349","村井　昭之","0476-37-4075","0476-37-4095",null,null,null,null,null,null,null,null,null,null,null,null,null,null,null,null,null,null,null,null,{"$f":"IF(NOT(ISBLANK(テーブル6[[#This Row],[土木一式]])),VLOOKUP(テーブル6[[#This Row],[土木一式]],土木[],2,TRUE), IF(NOT(ISBLANK(テーブル6[[#This Row],[許可区分(土木)]])),\"D\",\"-\"))","v":"-"},{"$f":"IF(NOT(ISBLANK(テーブル6[[#This Row],[建築一式]])),VLOOKUP(テーブル6[[#This Row],[建築一式]],建築[],2,TRUE), IF(NOT(ISBLANK(テーブル6[[#This Row],[許可区分（建築）]])),\"D\",\"-\"))","v":"-"},{"$f":"IF(NOT(ISBLANK(テーブル6[[#This Row],[電気]])),VLOOKUP(テーブル6[[#This Row],[電気]],電気[],2,TRUE), IF(NOT(ISBLANK(テーブル6[[#This Row],[許可区分（電気）]])),\"D\",\"-\"))","v":"-"},{"$f":"IF(NOT(ISBLANK(テーブル6[[#This Row],[管]])),VLOOKUP(テーブル6[[#This Row],[管]],管[],2,TRUE), IF(NOT(ISBLANK(テーブル6[[#This Row],[許可区分（管）]])),\"D\",\"-\"))","v":"-"},{"$f":"IF(NOT(ISBLANK(テーブル6[[#This Row],[ほ装]])),VLOOKUP(テーブル6[[#This Row],[ほ装]],ほ装[],2,TRUE), IF(NOT(ISBLANK(テーブル6[[#This Row],[許可区分(ほ装)]])),\"D\",\"-\"))","v":"-"},{"$f":"IF(NOT(ISBLANK(テーブル6[[#This Row],[塗装]])),VLOOKUP(テーブル6[[#This Row],[塗装]],塗装[],2,TRUE), IF(NOT(ISBLANK(テーブル6[[#This Row],[許可区分（塗装）]])),\"D\",\"-\"))","v":"-"},{"$f":"IF(NOT(ISBLANK(テーブル6[[#This Row],[防水]])),VLOOKUP(テーブル6[[#This Row],[防水]],塗装[],2,TRUE), IF(NOT(ISBLANK(テーブル6[[#This Row],[許可区分（防水）]])),\"D\",\"-\"))","v":"-"},{"$f":"IF(NOT(ISBLANK(テーブル6[[#This Row],[機械器具設置]])),VLOOKUP(テーブル6[[#This Row],[機械器具設置]],塗装[],2,TRUE), IF(NOT(ISBLANK(テーブル6[[#This Row],[許可区分（機械器具）]])),\"D\",\"-\"))","v":"-"},{"$f":"IF(NOT(ISBLANK(テーブル6[[#This Row],[電気通信]])),VLOOKUP(テーブル6[[#This Row],[電気通信]],電気[],2,TRUE), IF(NOT(ISBLANK(テーブル6[[#This Row],[許可区分(電気)]])),\"D\",\"-\"))","v":"-"},{"$f":"IF(NOT(ISBLANK(テーブル6[[#This Row],[水道施設]])),VLOOKUP(テーブル6[[#This Row],[水道施設]],水道[],2,TRUE), IF(NOT(ISBLANK(テーブル6[[#This Row],[許可区分（水道施設）]])),\"D\",\"-\"))","v":"-"},"設備保守点検、消防・防災用品"]
[42,"管内","秋葉建設㈱","匝瑳市南神崎52-1","秋葉　忠夫","0479-72-0814","0479-72-0824","一般",756,"特定",852,null,null,null,null,"一般",680,null,null,null,null,null,null,null,null,null,null,{"$f":"IF(NOT(ISBLANK(テーブル6[[#This Row],[土木一式]])),VLOOKUP(テーブル6[[#This Row],[土木一式]],土木[],2,TRUE), IF(NOT(ISBLANK(テーブル6[[#This Row],[許可区分(土木)]])),\"D\",\"-\"))","v":"A"},{"$f":"IF(NOT(ISBLANK(テーブル6[[#This Row],[建築一式]])),VLOOKUP(テーブル6[[#This Row],[建築一式]],建築[],2,TRUE), IF(NOT(ISBLANK(テーブル6[[#This Row],[許可区分（建築）]])),\"D\",\"-\"))","v":"A"},{"$f":"IF(NOT(ISBLANK(テーブル6[[#This Row],[電気]])),VLOOKUP(テーブル6[[#This Row],[電気]],電気[],2,TRUE), IF(NOT(ISBLANK(テーブル6[[#This Row],[許可区分（電気）]])),\"D\",\"-\"))","v":"-"},{"$f":"IF(NOT(ISBLANK(テーブル6[[#This Row],[管]])),VLOOKUP(テーブル6[[#This Row],[管]],管[],2,TRUE), IF(NOT(ISBLANK(テーブル6[[#This Row],[許可区分（管）]])),\"D\",\"-\"))","v":"-"},{"$f":"IF(NOT(ISBLANK(テーブル6[[#This Row],[ほ装]])),VLOOKUP(テーブル6[[#This Row],[ほ装]],ほ装[],2,TRUE), IF(NOT(ISBLANK(テーブル6[[#This Row],[許可区分(ほ装)]])),\"D\",\"-\"))","v":"B"},{"$f":"IF(NOT(ISBLANK(テーブル6[[#This Row],[塗装]])),VLOOKUP(テーブル6[[#This Row],[塗装]],塗装[],2,TRUE), IF(NOT(ISBLANK(テーブル6[[#This Row],[許可区分（塗装）]])),\"D\",\"-\"))","v":"-"},{"$f":"IF(NOT(ISBLANK(テーブル6[[#This Row],[防水]])),VLOOKUP(テーブル6[[#This Row],[防水]],塗装[],2,TRUE), IF(NOT(ISBLANK(テーブル6[[#This Row],[許可区分（防水）]])),\"D\",\"-\"))","v":"-"},{"$f":"IF(NOT(ISBLANK(テーブル6[[#This Row],[機械器具設置]])),VLOOKUP(テーブル6[[#This Row],[機械器具設置]],塗装[],2,TRUE), IF(NOT(ISBLANK(テーブル6[[#This Row],[許可区分（機械器具）]])),\"D\",\"-\"))","v":"-"},{"$f":"IF(NOT(ISBLANK(テーブル6[[#This Row],[電気通信]])),VLOOKUP(テーブル6[[#This Row],[電気通信]],電気[],2,TRUE), IF(NOT(ISBLANK(テーブル6[[#This Row],[許可区分(電気)]])),\"D\",\"-\"))","v":"-"},{"$f":"IF(NOT(ISBLANK(テーブル6[[#This Row],[水道施設]])),VLOOKUP(テーブル6[[#This Row],[水道施設]],水道[],2,TRUE), IF(NOT(ISBLANK(テーブル6[[#This Row],[許可区分（水道施設）]])),\"D\",\"-\"))","v":"-"}]

{"sheet":"公表名簿（県内建設)","index":1,"n_rows":113,"n_cols":37,"rows_kept":113,"cut":false,"hidden":false,"merged":[[0,6,0,11]]}
["八匝水道企業団建設工事等入札参加業者資格者名簿（県内建設）　",null,null,null,null,null,{"$f":"TODAY()","v":"2021-12-21"}]
["番号","区域","商号又は名称","所在地","代表者氏名","電話番号","ＦＡＸ","許可区分(土木)","土木一式","許可区分（建築）","建築一式","許可区分（電気）","電気","許可区分（管）","管","許可区分(ほ装)","ほ装","許可区分（塗装）","塗装","許可区分（防水）","防水","許可区分（機械器具）","機械器具設置","許可区分(電気)","電気通信","許可区分（水道施設）","水道施設","土木一式(等級)","建築一式(等級)","電気(等級)","管(等級)","ほ装(等級)","塗装(等級)","防水(等級)","機械器具設置(等級)","電気通信(等級)","水道施設(等級)"]
[1,"県内","庄司工業㈱","東金市台方2078","宇津木　孝次","0475-54-3451","0475-54-3455","特定",961,null,null,null,null,"特定",890,"特定",893,null,null,null,null,null,null,null,null,"特定",684,{"$f":"IF(NOT(ISBLANK(テーブル63[[#This Row],[土木一式]])),VLOOKUP(テーブル63[[#This Row],[土木一式]],土木[],2,TRUE), IF(NOT(ISBLANK(テーブル63[[#This Row],[許可区分(土木)]])),\"D\",\"-\"))","v":"A"},{"$f":"IF(NOT(ISBLANK(テーブル63[[#This Row],[建築一式]])),VLOOKUP(テーブル63[[#This Row],[建築一式]],建築[],2,TRUE), IF(NOT(ISBLANK(テーブル63[[#This Row],[許可区分（建築）]])),\"D\",\"-\"))","v":"-"},{"$f":"IF(NOT(ISBLANK(テーブル63[[#This Row],[電気]])),VLOOKUP(テーブル63[[#This Row],[電気]],電気[],2,TRUE), IF(NOT(ISBLANK(テーブル63[[#This Row],[許可区分（電気）]])),\"D\",\"-\"))","v":"-"},{"$f":"IF(NOT(ISBLANK(テーブル63[[#This Row],[管]])),VLOOKUP(テーブル63[[#This Row],[管]],管[],2,TRUE), IF(NOT(ISBLANK(テーブル63[[#This Row],[許可区分（管）]])),\"D\",\"-\"))","v":"A"},{"$f":"IF(NOT(ISBLANK(テーブル63[[#This Row],[ほ装]])),VLOOKUP(テーブル63[[#This Row],[ほ装]],ほ装[],2,TRUE), IF(NOT(ISBLANK(テーブル63[[#This Row],[許可区分(ほ装)]])),\"D\",\"-\"))","v":"A"},{"$f":"IF(NOT(ISBLANK(テーブル63[[#This Row],[塗装]])),VLOOKUP(テーブル63[[#This Row],[塗装]],塗装[],2,TRUE), IF(NOT(ISBLANK(テーブル63[[#This Row],[許可区分（塗装）]])),\"D\",\"-\"))","v":"-"},{"$f":"IF(NOT(ISBLANK(テーブル63[[#This Row],[防水]])),VLOOKUP(テーブル63[[#This Row],[防水]],塗装[],2,TRUE), IF(NOT(ISBLANK(テーブル63[[#This Row],[許可区分（防水）]])),\"D\",\"-\"))","v":"-"},{"$f":"IF(NOT(ISBLANK(テーブル63[[#This Row],[機械器具設置]])),VLOOKUP(テーブル63[[#This Row],[機械器具設置]],塗装[],2,TRUE), IF(NOT(ISBLANK(テーブル63[[#This Row],[許可区分（機械器具）]])),\"D\",\"-\"))","v":"-"},{"$f":"IF(NOT(ISBLANK(テーブル63[[#This Row],[電気通信]])),VLOOKUP(テーブル63[[#This Row],[電気通信]],電気[],2,TRUE), IF(NOT(ISBLANK(テーブル63[[#This Row],[許可区分(電気)]])),\"D\",\"-\"))","v":"-"},{"$f":"IF(NOT(ISBLANK(テーブル63[[#This Row],[水道施設]])),VLOOKUP(テーブル63[[#This Row],[水道施設]],水道[],2,TRUE), IF(NOT(ISBLANK(テーブル63[[#This Row],[許可区分（水道施設）]])),\"D\",\"-\"))","v":"C"}]
[2,"県内","京葉工管㈱","千葉市美浜区新港139-2","内藤　定雄","043-248-1472","043-248-1476","特定",1041,null,null,null,null,"特定",1062,"特定",843,null,null,null,null,null,null,null,null,"特定",752,{"$f":"IF(NOT(ISBLANK(テーブル63[[#This Row],[土木一式]])),VLOOKUP(テーブル63[[#This Row],[土木一式]],土木[],2,TRUE), IF(NOT(ISBLANK(テーブル63[[#This Row],[許可区分(土木)]])),\"D\",\"-\"))","v":"A"},{"$f":"IF(NOT(ISBLANK(テーブル63[[#This Row],[建築一式]])),VLOOKUP(テーブル63[[#This Row],[建築一式]],建築[],2,TRUE), IF(NOT(ISBLANK(テーブル63[[#This Row],[許可区分（建築）]])),\"D\",\"-\"))","v":"-"},{"$f":"IF(NOT(ISBLANK(テーブル63[[#This Row],[電気]])),VLOOKUP(テーブル63[[#This Row],[電気]],電気[],2,TRUE), IF(NOT(ISBLANK(テーブル63[[#This Row],[許可区分（電気）]])),\"D\",\"-\"))","v":"-"},{"$f":"IF(NOT(ISBLANK(テーブル63[[#This Row],[管]])),VLOOKUP(テーブル63[[#This Row],[管]],管[],2,TRUE), IF(NOT(ISBLANK(テーブル63[[#This Row],[許可区分（管）]])),\"D\",\"-\"))","v":"A"},{"$f":"IF(NOT(ISBLANK(テーブル63[[#This Row],[ほ装]])),VLOOKUP(テーブル63[[#This Row],[ほ装]],ほ装[],2,TRUE), IF(NOT(ISBLANK(テーブル63[[#This Row],[許可区分(ほ装)]])),\"D\",\"-\"))","v":"A"},{"$f":"IF(NOT(ISBLANK(テーブル63[[#This Row],[塗装]])),VLOOKUP(テーブル63[[#This Row],[塗装]],塗装[],2,TRUE), IF(NOT(ISBLANK(テーブル63[[#This Row],[許可区分（塗装）]])),\"D\",\"-\"))","v":"-"},{"$f":"IF(NOT(ISBLANK(テーブル63[[#This Row],[防水]])),VLOOKUP(テーブル63[[#This Row],[防水]],塗装[],2,TRUE), IF(NOT(ISBLANK(テーブル63[[#This Row],[許可区分（防水）]])),\"D\",\"-\"))","v":"-"},{"$f":"IF(NOT(ISBLANK(テーブル63[[#This Row],[機械器具設置]])),VLOOKUP(テーブル63[[#This Row],[機械器具設置]],塗装[],2,TRUE), IF(NOT(ISBLANK(テーブル63[[#This Row],[許可区分（機械器具）]])),\"D\",\"-\"))","v":"-"},{"$f":"IF(NOT(ISBLANK(テーブル63[[#This Row],[電気通信]])),VLOOKUP(テーブル63[[#This Row],[電気通信]],電気[],2,TRUE), IF(NOT(ISBLANK(テーブル63[[#This Row],[許可区分(電気)]])),\"D\",\"-\"))","v":"-"},{"$f":"IF(NOT(ISBLANK(テーブル63[[#This Row],[水道施設]])),VLOOKUP(テーブル63[[#This Row],[水道施設]],水道[],2,TRUE), IF(NOT(ISBLANK(テーブル63[[#This Row],[許可区分（水道施設）]])),\"D\",\"-\"))","v":"B"}]
[3,"県内","荏原商事㈱　千葉営業所","松戸市常磐平5-18-1","菊池　敦","047-311-0380","047-311-0381","特定",981,"特定",871,"特定",1338,"特定",1146,null,null,"特定",861,"特定",856,"特定",1325,"一般",966,"特定",1234,{"$f":"IF(NOT(ISBLANK(テーブル63[[#This Row],[土木一式]])),VLOOKUP(テーブル63[[#This Row],[土木一式]],土木[],2,TRUE), IF(NOT(ISBLANK(テーブル63[[#This Row],[許可区分(土木)]])),\"D\",\"-\"))","v":"A"},{"$f":"IF(NOT(ISBLANK(テーブル63[[#This Row],[建築一式]])),VLOOKUP(テーブル63[[#This Row],[建築一式]],建築[],2,TRUE), IF(NOT(ISBLANK(テーブル63[[#This Row],[許可区分（建築）]])),\"D\",\"-\"))","v":"A"},{"$f":"IF(NOT(ISBLANK(テーブル63[[#This Row],[電気]])),VLOOKUP(テーブル63[[#This Row],[電気]],電気[],2,TRUE), IF(NOT(ISBLANK(テーブル63[[#This Row],[許可区分（電気）]])),\"D\",\"-\"))","v":"A"},{"$f":"IF(NOT(ISBLANK(テーブル63[[#This Row],[管]])),VLOOKUP(テーブル63[[#This Row],[管]],管[],2,TRUE), IF(NOT(ISBLANK(テーブル63[[#This Row],[許可区分（管）]])),\"D\",\"-\"))","v":"A"},{"$f":"IF(NOT(ISBLANK(テーブル63[[#This Row],[ほ装]])),VLOOKUP(テーブル63[[#This Row],[ほ装]],ほ装[],2,TRUE), IF(NOT(ISBLANK(テーブル63[[#This Row],[許可区分(ほ装)]])),\"D\",\"-\"))","v":"-"},{"$f":"IF(NOT(ISBLANK(テーブル63[[#This Row],[塗装]])),VLOOKUP(テーブル63[[#This Row],[塗装]],塗装[],2,TRUE), IF(NOT(ISBLANK(テーブル63[[#This Row],[許可区分（塗装）]])),\"D\",\"-\"))","v":"A"},{"$f":"IF(NOT(ISBLANK(テーブル63[[#This Row],[防水]])),VLOOKUP(テーブル63[[#This Row],[防水]],塗装[],2,TRUE), IF(NOT(ISBLANK(テーブル63[[#This Row],[許可区分（防水）]])),\"D\",\"-\"))","v":"A"},{"$f":"IF(NOT(ISBLANK(テーブル63[[#This Row],[機械器具設置]])),VLOOKUP(テーブル63[[#This Row],[機械器具設置]],塗装[],2,TRUE), IF(NOT(ISBLANK(テーブル63[[#This Row],[許可区分（機械器具）]])),\"D\",\"-\"))","v":"A"},{"$f":"IF(NOT(ISBLANK(テーブル63[[#This Row],[電気通信]])),VLOOKUP(テーブル63[[#This Row],[電気通信]],電気[],2,TRUE), IF(NOT(ISBLANK(テーブル63[[#This Row],[許可区分(電気)]])),\"D\",\"-\"))","v":"A"},{"$f":"IF(NOT(ISBLANK(テーブル63[[#This Row],[水道施設]])),VLOOKUP(テーブル63[[#This Row],[水道施設]],水道[],2,TRUE), IF(NOT(ISBLANK(テーブル63[[#This Row],[許可区分（水道施設）]])),\"D\",\"-\"))","v":"A"}]
[4,"県内","日特建設㈱　千葉営業所","千葉市中央区中央3-10-4","杉山　直樹","043-225-8023","043-225-8084","特定",1494,null,null,null,null,null,null,"特定",918,null,null,null,null,null,null,null,null,"特定",918,{"$f":"IF(NOT(ISBLANK(テーブル63[[#This Row],[土木一式]])),VLOOKUP(テーブル63[[#This Row],[土木一式]],土木[],2,TRUE), IF(NOT(ISBLANK(テーブル63[[#This Row],[許可区分(土木)]])),\"D\",\"-\"))","v":"A"},{"$f":"IF(NOT(ISBLANK(テーブル63[[#This Row],[建築一式]])),VLOOKUP(テーブル63[[#This Row],[建築一式]],建築[],2,TRUE), IF(NOT(ISBLANK(テーブル63[[#This Row],[許可区分（建築）]])),\"D\",\"-\"))","v":"-"},{"$f":"IF(NOT(ISBLANK(テーブル63[[#This Row],[電気]])),VLOOKUP(テーブル63[[#This Row],[電気]],電気[],2,TRUE), IF(NOT(ISBLANK(テーブル63[[#This Row],[許可区分（電気）]])),\"D\",\"-\"))","v":"-"},{"$f":"IF(NOT(ISBLANK(テーブル63[[#This Row],[管]])),VLOOKUP(テーブル63[[#This Row],[管]],管[],2,TRUE), IF(NOT(ISBLANK(テーブル63[[#This Row],[許可区分（管）]])),\"D\",\"-\"))","v":"-"},{"$f":"IF(NOT(ISBLANK(テーブル63[[#This Row],[ほ装]])),VLOOKUP(テーブル63[[#This Row],[ほ装]],ほ装[],2,TRUE), IF(NOT(ISBLANK(テーブル63[[#This Row],[許可区分(ほ装)]])),\"D\",\"-\"))","v":"A"},{"$f":"IF(NOT(ISBLANK(テーブル63[[#This Row],[塗装]])),VLOOKUP(テーブル63[[#This Row],[塗装]],塗装[],2,TRUE), IF(NOT(ISBLANK(テーブル63[[#This Row],[許可区分（塗装）]])),\"D\",\"-\"))","v":"-"},{"$f":"IF(NOT(ISBLANK(テーブル63[[#This Row],[防水]])),VLOOKUP(テーブル63[[#This Row],[防水]],塗装[],2,TRUE), IF(NOT(ISBLANK(テーブル63[[#This Row],[許可区分（防水）]])),\"D\",\"-\"))","v":"-"},{"$f":"IF(NOT(ISBLANK(テーブル63[[#This Row],[機械器具設置]])),VLOOKUP(テーブル63[[#This Row],[機械器具設置]],塗装[],2,TRUE), IF(NOT(ISBLANK(テーブル63[[#This Row],[許可区分（機械器具）]])),\"D\",\"-\"))","v":"-"},{"$f":"IF(NOT(ISBLANK(テーブル63[[#This Row],[電気通信]])),VLOOKUP(テーブル63[[#This Row],[電気通信]],電気[],2,TRUE), IF(NOT(ISBLANK(テーブル63[[#This Row],[許可区分(電気)]])),\"D\",\"-\"))","v":"-"},{"$f":"IF(NOT(ISBLANK(テーブル63[[#This Row],[水道施設]])),VLOOKUP(テーブル63[[#This Row],[水道施設]],水道[],2,TRUE), IF(NOT(ISBLANK(テーブル63[[#This Row],[許可区分（水道施設）]])),\"D\",\"-\"))","v":"A"}]
[5,"県内","スイス通信システム㈱","千葉市中央区都町1254-6","平野　恒次","043-231-8231","043-231-8166",null,null,null,null,"特定",785,null,null,null,null,null,null,null,null,null,null,"特定",968,null,null,{"$f":"IF(NOT(ISBLANK(テーブル63[[#This Row],[土木一式]])),VLOOKUP(テーブル63[[#This Row],[土木一式]],土木[],2,TRUE), IF(NOT(ISBLANK(テーブル63[[#This Row],[許可区分(土木)]])),\"D\",\"-\"))","v":"-"},{"$f":"IF(NOT(ISBLANK(テーブル63[[#This Row],[建築一式]])),VLOOKUP(テーブル63[[#This Row],[建築一式]],建築[],2,TRUE), IF(NOT(ISBLANK(テーブル63[[#This Row],[許可区分（建築）]])),\"D\",\"-\"))","v":"-"},{"$f":"IF(NOT(ISBLANK(テーブル63[[#This Row],[電気]])),VLOOKUP(テーブル63[[#This Row],[電気]],電気[],2,TRUE), IF(NOT(ISBLANK(テーブル63[[#This Row],[許可区分（電気）]])),\"D\",\"-\"))","v":"B"},{"$f":"IF(NOT(ISBLANK(テーブル63[[#This Row],[管]])),VLOOKUP(テーブル63[[#This Row],[管]],管[],2,TRUE), IF(NOT(ISBLANK(テーブル63[[#This Row],[許可区分（管）]])),\"D\",\"-\"))","v":"-"},{"$f":"IF(NOT(ISBLANK(テーブル63[[#This Row],[ほ装]])),VLOOKUP(テーブル63[[#This Row],[ほ装]],ほ装[],2,TRUE), IF(NOT(ISBLANK(テーブル63[[#This Row],[許可区分(ほ装)]])),\"D\",\"-\"))","v":"-"},{"$f":"IF(NOT(ISBLANK(テーブル63[[#This Row],[塗装]])),VLOOKUP(テーブル63[[#This Row],[塗装]],塗装[],2,TRUE), IF(NOT(ISBLANK(テーブル63[[#This Row],[許可区分（塗装）]])),\"D\",\"-\"))","v":"-"},{"$f":"IF(NOT(ISBLANK(テーブル63[[#This Row],[防水]])),VLOOKUP(テーブル63[[#This Row],[防水]],塗装[],2,TRUE), IF(NOT(ISBLANK(テーブル63[[#This Row],[許可区分（防水）]])),\"D\",\"-\"))","v":"-"},{"$f":"IF(NOT(ISBLANK(テーブル63[[#This Row],[機械器具設置]])),VLOOKUP(テーブル63[[#This Row],[機械器具設置]],塗装[],2,TRUE), IF(NOT(ISBLANK(テーブル63[[#This Row],[許可区分（機械器具）]])),\"D\",\"-\"))","v":"-"},{"$f":"IF(NOT(ISBLANK(テーブル63[[#This Row],[電気通信]])),VLOOKUP(テーブル63[[#This Row],[電気通信]],電気[],2,TRUE), IF(NOT(ISBLANK(テーブル63[[#This Row],[許可区分(電気)]])),\"D\",\"-\"))","v":"A"},{"$f":"IF(NOT(ISBLANK(テーブル63[[#This Row],[水道施設]])),VLOOKUP(テーブル63[[#This Row],[水道施設]],水道[],2,TRUE), IF(NOT(ISBLANK(テーブル63[[#This Row],[許可区分（水道施設）]])),\"D\",\"-\"))","v":"-"}]
[6,"県内","日成ビルド工業㈱　千葉支店","千葉市中央区神明町541-4","中島　弘晶","043-241-1613","043-246-5823","特定",null,"特定",1531,"一般",null,null,null,null,null,"特定",null,"特定",null,"一般",1153,null,null,null,null,{"$f":"IF(NOT(ISBLANK(テーブル63[[#This Row],[土木一式]])),VLOOKUP(テーブル63[[#This Row],[土木一式]],土木[],2,TRUE), IF(NOT(ISBLANK(テーブル63[[#This Row],[許可区分(土木)]])),\"D\",\"-\"))","v":"D"},{"$f":"IF(NOT(ISBLANK(テーブル63[[#This Row],[建築一式]])),VLOOKUP(テーブル63[[#This Row],[建築一式]],建築[],2,TRUE), IF(NOT(ISBLANK(テーブル63[[#This Row],[許可区分（建築）]])),\"D\",\"-\"))","v":"A"},{"$f":"IF(NOT(ISBLANK(テーブル63[[#This Row],[電気]])),VLOOKUP(テーブル63[[#This Row],[電気]],電気[],2,TRUE), IF(NOT(ISBLANK(テーブル63[[#This Row],[許可区分（電気）]])),\"D\",\"-\"))","v":"D"},{"$f":"IF(NOT(ISBLANK(テーブル63[[#This Row],[管]])),VLOOKUP(テーブル63[[#This Row],[管]],管[],2,TRUE), IF(NOT(ISBLANK(テーブル63[[#This Row],[許可区分（管）]])),\"D\",\"-\"))","v":"-"},{"$f":"IF(NOT(ISBLANK(テーブル63[[#This Row],[ほ装]])),VLOOKUP(テーブル63[[#This Row],[ほ装]],ほ装[],2,TRUE), IF(NOT(ISBLANK(テーブル63[[#This Row],[許可区分(ほ装)]])),\"D\",\"-\"))","v":"-"},{"$f":"IF(NOT(ISBLANK(テーブル63[[#This Row],[塗装]])),VLOOKUP(テーブル63[[#This Row],[塗装]],塗装[],2,TRUE), IF(NOT(ISBLANK(テーブル63[[#This Row],[許可区分（塗装）]])),\"D\",\"-\"))","v":"D"},{"$f":"IF(NOT(ISBLANK(テーブル63[[#This Row],[防水]])),VLOOKUP(テーブル63[[#This Row],[防水]],塗装[],2,TRUE), IF(NOT(ISBLANK(テーブル63[[#This Row],[許可区分（防水）]])),\"D\",\"-\"))","v":"D"},{"$f":"IF(NOT(ISBLANK(テーブル63[[#This Row],[機械器具設置]])),VLOOKUP(テーブル63[[#This Row],[機械器具設置]],塗装[],2,TRUE), IF(NOT(ISBLANK(テーブル63[[#This Row],[許可区分（機械器具）]])),\"D\",\"-\"))","v":"A"},{"$f":"IF(NOT(ISBLANK(テーブル63[[#This Row],[電気通信]])),VLOOKUP(テーブル63[[#This Row],[電気通信]],電気[],2,TRUE), IF(NOT(ISBLANK(テーブル63[[#This Row],[許可区分(電気)]])),\"D\",\"-\"))","v":"-"},{"$f":"IF(NOT(ISBLANK(テーブル63[[#This Row],[水道施設]])),VLOOKUP(テーブル63[[#This Row],[水道施設]],水道[],2,TRUE), IF(NOT(ISBLANK(テーブル63[[#This Row],[許可区分（水道施設）]])),\"D\",\"-\"))","v":"-"}]
[7,"県内","工藤電機工業㈱","柏市新柏1-16-12","工藤　賢作","04-7166-9022","04-7166-9077",null,null,null,null,"特定",1190,"特定",869,null,null,null,null,null,null,null,null,null,null,null,null,{"$f":"IF(NOT(ISBLANK(テーブル63[[#This Row],[土木一式]])),VLOOKUP(テーブル63[[#This Row],[土木一式]],土木[],2,TRUE), IF(NOT(ISBLANK(テーブル63[[#This Row],[許可区分(土木)]])),\"D\",\"-\"))","v":"-"},{"$f":"IF(NOT(ISBLANK(テーブル63[[#This Row],[建築一式]])),VLOOKUP(テーブル63[[#This Row],[建築一式]],建築[],2,TRUE), IF(NOT(ISBLANK(テーブル63[[#This Row],[許可区分（建築）]])),\"D\",\"-\"))","v":"-"},{"$f":"IF(NOT(ISBLANK(テーブル63[[#This Row],[電気]])),VLOOKUP(テーブル63[[#This Row],[電気]],電気[],2,TRUE), IF(NOT(ISBLANK(テーブル63[[#This Row],[許可区分（電気）]])),\"D\",\"-\"))","v":"A"},{"$f":"IF(NOT(ISBLANK(テーブル63[[#This Row],[管]])),VLOOKUP(テーブル63[[#This Row],[管]],管[],2,TRUE), IF(NOT(ISBLANK(テーブル63[[#This Row],[許可区分（管）]])),\"D\",\"-\"))","v":"A"},{"$f":"IF(NOT(ISBLANK(テーブル63[[#This Row],[ほ装]])),VLOOKUP(テーブル63[[#This Row],[ほ装]],ほ装[],2,TRUE), IF(NOT(ISBLANK(テーブル63[[#This Row],[許可区分(ほ装)]])),\"D\",\"-\"))","v":"-"},{"$f":"IF(NOT(ISBLANK(テーブル63[[#This Row],[塗装]])),VLOOKUP(テーブル63[[#This Row],[塗装]],塗装[],2,TRUE), IF(NOT(ISBLANK(テーブル63[[#This Row],[許可区分（塗装）]])),\"D\",\"-\"))","v":"-"},{"$f":"IF(NOT(ISBLANK(テーブル63[[#This Row],[防水]])),VLOOKUP(テーブル63[[#This Row],[防水]],塗装[],2,TRUE), IF(NOT(ISBLANK(テーブル63[[#This Row],[許可区分（防水）]])),\"D\",\"-\"))","v":"-"},{"$f":"IF(NOT(ISBLANK(テーブル63[[#This Row],[機械器具設置]])),VLOOKUP(テーブル63[[#This Row],[機械器具設置]],塗装[],2,TRUE), IF(NOT(ISBLANK(テーブル63[[#This Row],[許可区分（機械器具）]])),\"D\",\"-\"))","v":"-"},{"$f":"IF(NOT(ISBLANK(テーブル63[[#This Row],[電気通信]])),VLOOKUP(テーブル63[[#This Row],[電気通信]],電気[],2,TRUE), IF(NOT(ISBLANK(テーブル63[[#This Row],[許可区分(電気)]])),\"D\",\"-\"))","v":"-"},{"$f":"IF(NOT(ISBLANK(テーブル63[[#This Row],[水道施設]])),VLOOKUP(テーブル63[[#This Row],[水道施設]],水道[],2,TRUE), IF(NOT(ISBLANK(テーブル63[[#This Row],[許可区分（水道施設）]])),\"D\",\"-\"))","v":"-"}]
[8,"県内","呉光塗装㈱","松戸市中根長津町25","奥野　眞一","047-365-1531","047-365-4221",null,null,"特定",999,null,null,null,null,null,null,"特定",1061,"特定",1002,null,null,null,null,null,null,{"$f":"IF(NOT(ISBLANK(テーブル63[[#This Row],[土木一式]])),VLOOKUP(テーブル63[[#This Row],[土木一式]],土木[],2,TRUE), IF(NOT(ISBLANK(テーブル63[[#This Row],[許可区分(土木)]])),\"D\",\"-\"))","v":"-"},{"$f":"IF(NOT(ISBLANK(テーブル63[[#This Row],[建築一式]])),VLOOKUP(テーブル63[[#This Row],[建築一式]],建築[],2,TRUE), IF(NOT(ISBLANK(テーブル63[[#This Row],[許可区分（建築）]])),\"D\",\"-\"))","v":"A"},{"$f":"IF(NOT(ISBLANK(テーブル63[[#This Row],[電気]])),VLOOKUP(テーブル63[[#This Row],[電気]],電気[],2,TRUE), IF(NOT(ISBLANK(テーブル63[[#This Row],[許可区分（電気）]])),\"D\",\"-\"))","v":"-"},{"$f":"IF(NOT(ISBLANK(テーブル63[[#This Row],[管]])),VLOOKUP(テーブル63[[#This Row],[管]],管[],2,TRUE), IF(NOT(ISBLANK(テーブル63[[#This Row],[許可区分（管）]])),\"D\",\"-\"))","v":"-"},{"$f":"IF(NOT(ISBLANK(テーブル63[[#This Row],[ほ装]])),VLOOKUP(テーブル63[[#This Row],[ほ装]],ほ装[],2,TRUE), IF(NOT(ISBLANK(テーブル63[[#This Row],[許可区分(ほ装)]])),\"D\",\"-\"))","v":"-"},{"$f":"IF(NOT(ISBLANK(テーブル63[[#This Row],[塗装]])),VLOOKUP(テーブル63[[#This Row],[塗装]],塗装[],2,TRUE), IF(NOT(ISBLANK(テーブル63[[#This Row],[許可区分（塗装）]])),\"D\",\"-\"))","v":"A"},{"$f":"IF(NOT(ISBLANK(テーブル63[[#This Row],[防水]])),VLOOKUP(テーブル63[[#This Row],[防水]],塗装[],2,TRUE), IF(NOT(ISBLANK(テーブル63[[#This Row],[許可区分（防水）]])),\"D\",\"-\"))","v":"A"},{"$f":"IF(NOT(ISBLANK(テーブル63[[#This Row],[機械器具設置]])),VLOOKUP(テーブル63[[#This Row],[機械器具設置]],塗装[],2,TRUE), IF(NOT(ISBLANK(テーブル63[[#This Row],[許可区分（機械器具）]])),\"D\",\"-\"))","v":"-"},{"$f":"IF(NOT(ISBLANK(テーブル63[[#This Row],[電気通信]])),VLOOKUP(テーブル63[[#This Row],[電気通信]],電気[],2,TRUE), IF(NOT(ISBLANK(テーブル63[[#This Row],[許可区分(電気)]])),\"D\",\"-\"))","v":"-"},{"$f":"IF(NOT(ISBLANK(テーブル63[[#This Row],[水道施設]])),VLOOKUP(テーブル63[[#This Row],[水道施設]],水道[],2,TRUE), IF(NOT(ISBLANK(テーブル63[[#This Row],[許可区分（水道施設）]])),\"D\",\"-\"))","v":"-"}]
[9,"県内","日本技建㈱","船橋市市場5-9-22","大岩　勝則","047-424-8111","047-422-6918",null,null,null,null,null,null,"特定",713,null,null,null,null,null,null,"一般",735,null,null,"特定",587,{"$f":"IF(NOT(ISBLANK(テーブル63[[#This Row],[土木一式]])),VLOOKUP(テーブル63[[#This Row],[土木一式]],土木[],2,TRUE), IF(NOT(ISBLANK(テーブル63[[#This Row],[許可区分(土木)]])),\"D\",\"-\"))","v":"-"},{"$f":"IF(NOT(ISBLANK(テーブル63[[#This Row],[建築一式]])),VLOOKUP(テーブル63[[#This Row],[建築一式]],建築[],2,TRUE), IF(NOT(ISBLANK(テーブル63[[#This Row],[許可区分（建築）]])),\"D\",\"-\"))","v":"-"},{"$f":"IF(NOT(ISBLANK(テーブル63[[#This Row],[電気]])),VLOOKUP(テーブル63[[#This Row],[電気]],電気[],2,TRUE), IF(NOT(ISBLANK(テーブル63[[#This Row],[許可区分（電気）]])),\"D\",\"-\"))","v":"-"},{"$f":"IF(NOT(ISBLANK(テーブル63[[#This Row],[管]])),VLOOKUP(テーブル63[[#This Row],[管]],管[],2,TRUE), IF(NOT(ISBLANK(テーブル63[[#This Row],[許可区分（管）]])),\"D\",\"-\"))","v":"A"},{"$f":"IF(NOT(ISBLANK(テーブル63[[#This Row],[ほ装]])),VLOOKUP(テーブル63[[#This Row],[ほ装]],ほ装[],2,TRUE), IF(NOT(ISBLANK(テーブル63[[#This Row],[許可区分(ほ装)]])),\"D\",\"-\"))","v":"-"},{"$f":"IF(NOT(ISBLANK(テーブル63[[#This Row],[塗装]])),VLOOKUP(テーブル63[[#This Row],[塗装]],塗装[],2,TRUE), IF(NOT(ISBLANK(テーブル63[[#This Row],[許可区分（塗装）]])),\"D\",\"-\"))","v":"-"},{"$f":"IF(NOT(ISBLANK(テーブル63[[#This Row],[防水]])),VLOOKUP(テーブル63[[#This Row],[防水]],塗装[],2,TRUE), IF(NOT(ISBLANK(テーブル63[[#This Row],[許可区分（防水）]])),\"D\",\"-\"))","v":"-"},{"$f":"IF(NOT(ISBLANK(テーブル63[[#This Row],[機械器具設置]])),VLOOKUP(テーブル63[[#This Row],[機械器具設置]],塗装[],2,TRUE), IF(NOT(ISBLANK(テーブル63[[#This Row],[許可区分（機械器具）]])),\"D\",\"-\"))","v":"B"},{"$f":"IF(NOT(ISBLANK(テーブル63[[#This Row],[電気通信]])),VLOOKUP(テーブル63[[#This Row],[電気通信]],電気[],2,TRUE), IF(NOT(ISBLANK(テーブル63[[#This Row],[許可区分(電気)]])),\"D\",\"-\"))","v":"-"},{"$f":"IF(NOT(ISBLANK(テーブル63[[#This Row],[水道施設]])),VLOOKUP(テーブル63[[#This Row],[水道施設]],水道[],2,TRUE), IF(NOT(ISBLANK(テーブル63[[#This Row],[許可区分（水道施設）]])),\"D\",\"-\"))","v":"D"}]
[10,"県内","髙率電設㈱","千葉市稲毛区緑町1-5-8","小川　力","043-242-1539","043-242-1884",null,null,null,null,"特定",1014,null,null,null,null,null,null,null,null,null,null,null,null,null,null,{"$f":"IF(NOT(ISBLANK(テーブル63[[#This Row],[土木一式]])),VLOOKUP(テーブル63[[#This Row],[土木一式]],土木[],2,TRUE), IF(NOT(ISBLANK(テーブル63[[#This Row],[許可区分(土木)]])),\"D\",\"-\"))","v":"-"},{"$f":"IF(NOT(ISBLANK(テーブル63[[#This Row],[建築一式]])),VLOOKUP(テーブル63[[#This Row],[建築一式]],建築[],2,TRUE), IF(NOT(ISBLANK(テーブル63[[#This Row],[許可区分（建築）]])),\"D\",\"-\"))","v":"-"},{"$f":"IF(NOT(ISBLANK(テーブル63[[#This Row],[電気]])),VLOOKUP(テーブル63[[#This Row],[電気]],電気[],2,TRUE), IF(NOT(ISBLANK(テーブル63[[#This Row],[許可区分（電気）]])),\"D\",\"-\"))","v":"A"},{"$f":"IF(NOT(ISBLANK(テーブル63[[#This Row],[管]])),VLOOKUP(テーブル63[[#This Row],[管]],管[],2,TRUE), IF(NOT(ISBLANK(テーブル63[[#This Row],[許可区分（管）]])),\"D\",\"-\"))","v":"-"},{"$f":"IF(NOT(ISBLANK(テーブル63[[#This Row],[ほ装]])),VLOOKUP(テーブル63[[#This Row],[ほ装]],ほ装[],2,TRUE), IF(NOT(ISBLANK(テーブル63[[#This Row],[許可区分(ほ装)]])),\"D\",\"-\"))","v":"-"},{"$f":"IF(NOT(ISBLANK(テーブル63[[#This Row],[塗装]])),VLOOKUP(テーブル63[[#This Row],[塗装]],塗装[],2,TRUE), IF(NOT(ISBLANK(テーブル63[[#This Row],[許可区分（塗装）]])),\"D\",\"-\"))","v":"-"},{"$f":"IF(NOT(ISBLANK(テーブル63[[#This Row],[防水]])),VLOOKUP(テーブル63[[#This Row],[防水]],塗装[],2,TRUE), IF(NOT(ISBLANK(テーブル63[[#This Row],[許可区分（防水）]])),\"D\",\"-\"))","v":"-"},{"$f":"IF(NOT(ISBLANK(テーブル63[[#This Row],[機械器具設置]])),VLOOKUP(テーブル63[[#This Row],[機械器具設置]],塗装[],2,TRUE), IF(NOT(ISBLANK(テーブル63[[#This Row],[許可区分（機械器具）]])),\"D\",\"-\"))","v":"-"},{"$f":"IF(NOT(ISBLANK(テーブル63[[#This Row],[電気通信]])),VLOOKUP(テーブル63[[#This Row],[電気通信]],電気[],2,TRUE), IF(NOT(ISBLANK(テーブル63[[#This Row],[許可区分(電気)]])),\"D\",\"-\"))","v":"-"},{"$f":"IF(NOT(ISBLANK(テーブル63[[#This Row],[水道施設]])),VLOOKUP(テーブル63[[#This Row],[水道施設]],水道[],2,TRUE), IF(NOT(ISBLANK(テーブル63[[#This Row],[許可区分（水道施設）]])),\"D\",\"-\"))","v":"-"}]
[11,"県内","㈱エス・アイ・シー","千葉市中央区問屋町1-35","取締役営業部長　高橋　春樹","043-301-8822","043-301-8839",null,null,null,null,"特定",943,null,null,null,null,null,null,null,null,"特定",710,"特定",771,null,null,{"$f":"IF(NOT(ISBLANK(テーブル63[[#This Row],[土木一式]])),VLOOKUP(テーブル63[[#This Row],[土木一式]],土木[],2,TRUE), IF(NOT(ISBLANK(テーブル63[[#This Row],[許可区分(土木)]])),\"D\",\"-\"))","v":"-"},{"$f":"IF(NOT(ISBLANK(テーブル63[[#This Row],[建築一式]])),VLOOKUP(テーブル63[[#This Row],[建築一式]],建築[],2,TRUE), IF(NOT(ISBLANK(テーブル63[[#This Row],[許可区分（建築）]])),\"D\",\"-\"))","v":"-"},{"$f":"IF(NOT(ISBLANK(テーブル63[[#This Row],[電気]])),VLOOKUP(テーブル63[[#This Row],[電気]],電気[],2,TRUE), IF(NOT(ISBLANK(テーブル63[[#This Row],[許可区分（電気）]])),\"D\",\"-\"))","v":"A"},{"$f":"IF(NOT(ISBLANK(テーブル63[[#This Row],[管]])),VLOOKUP(テーブル63[[#This Row],[管]],管[],2,TRUE), IF(NOT(ISBLANK(テーブル63[[#This Row],[許可区分（管）]])),\"D\",\"-\"))","v":"-"},{"$f":"IF(NOT(ISBLANK(テーブル63[[#This Row],[ほ装]])),VLOOKUP(テーブル63[[#This Row],[ほ装]],ほ装[],2,TRUE), IF(NOT(ISBLANK(テーブル63[[#This Row],[許可区分(ほ装)]])),\"D\",\"-\"))","v":"-"},{"$f":"IF(NOT(ISBLANK(テーブル63[[#This Row],[塗装]])),VLOOKUP(テーブル63[[#This Row],[塗装]],塗装[],2,TRUE), IF(NOT(ISBLANK(テーブル63[[#This Row],[許可区分（塗装）]])),\"D\",\"-\"))","v":"-"},{"$f":"IF(NOT(ISBLANK(テーブル63[[#This Row],[防水]])),VLOOKUP(テーブル63[[#This Row],[防水]],塗装[],2,TRUE), IF(NOT(ISBLANK(テーブル63[[#This Row],[許可区分（防水）]])),\"D\",\"-\"))","v":"-"},{"$f":"IF(NOT(ISBLANK(テーブル63[[#This Row],[機械器具設置]])),VLOOKUP(テーブル63[[#This Row],[機械器具設置]],塗装[],2,TRUE), IF(NOT(ISBLANK(テーブル63[[#This Row],[許可区分（機械器具）]])),\"D\",\"-\"))","v":"B"},{"$f":"IF(NOT(ISBLANK(テーブル63[[#This Row],[電気通信]])),VLOOKUP(テーブル63[[#This Row],[電気通信]],電気[],2,TRUE), IF(NOT(ISBLANK(テーブル63[[#This Row],[許可区分(電気)]])),\"D\",\"-\"))","v":"B"},{"$f":"IF(NOT(ISBLANK(テーブル63[[#This Row],[水道施設]])),VLOOKUP(テーブル63[[#This Row],[水道施設]],水道[],2,TRUE), IF(NOT(ISBLANK(テーブル63[[#This Row],[許可区分（水道施設）]])),\"D\",\"-\"))","v":"-"}]
[12,"県内","吉岡建設㈱","山武郡横芝光町横芝800","吉岡　昭","0479-82-1231","0479-82-1233","特定",804,"特定",980,null,null,null,null,"特定",742,"特定",678,"特定",683,null,null,null,null,"特定",660,{"$f":"IF(NOT(ISBLANK(テーブル63[[#This Row],[土木一式]])),VLOOKUP(テーブル63[[#This Row],[土木一式]],土木[],2,TRUE), IF(NOT(ISBLANK(テーブル63[[#This Row],[許可区分(土木)]])),\"D\",\"-\"))","v":"A"},{"$f":"IF(NOT(ISBLANK(テーブル63[[#This Row],[建築一式]])),VLOOKUP(テーブル63[[#This Row],[建築一式]],建築[],2,TRUE), IF(NOT(ISBLANK(テーブル63[[#This Row],[許可区分（建築）]])),\"D\",\"-\"))","v":"A"},{"$f":"IF(NOT(ISBLANK(テーブル63[[#This Row],[電気]])),VLOOKUP(テーブル63[[#This Row],[電気]],電気[],2,TRUE), IF(NOT(ISBLANK(テーブル63[[#This Row],[許可区分（電気）]])),\"D\",\"-\"))","v":"-"},{"$f":"IF(NOT(ISBLANK(テーブル63[[#This Row],[管]])),VLOOKUP(テーブル63[[#This Row],[管]],管[],2,TRUE), IF(NOT(ISBLANK(テーブル63[[#This Row],[許可区分（管）]])),\"D\",\"-\"))","v":"-"},{"$f":"IF(NOT(ISBLANK(テーブル63[[#This Row],[ほ装]])),VLOOKUP(テーブル63[[#This Row],[ほ装]],ほ装[],2,TRUE), IF(NOT(ISBLANK(テーブル63[[#This Row],[許可区分(ほ装)]])),\"D\",\"-\"))","v":"A"},{"$f":"IF(NOT(ISBLANK(テーブル63[[#This Row],[塗装]])),VLOOKUP(テーブル63[[#This Row],[塗装]],塗装[],2,TRUE), IF(NOT(ISBLANK(テーブル63[[#This Row],[許可区分（塗装）]])),\"D\",\"-\"))","v":"C"},{"$f":"IF(NOT(ISBLANK(テーブル63[[#This Row],[防水]])),VLOOKUP(テーブル63[[#This Row],[防水]],塗装[],2,TRUE), IF(NOT(ISBLANK(テーブル63[[#This Row],[許可区分（防水）]])),\"D\",\"-\"))","v":"C"},{"$f":"IF(NOT(ISBLANK(テーブル63[[#This Row],[機械器具設置]])),VLOOKUP(テーブル63[[#This Row],[機械器具設置]],塗装[],2,TRUE), IF(NOT(ISBLANK(テーブル63[[#This Row],[許可区分（機械器具）]])),\"D\",\"-\"))","v":"-"},{"$f":"IF(NOT(ISBLANK(テーブル63[[#This Row],[電気通信]])),VLOOKUP(テーブル63[[#This Row],[電気通信]],電気[],2,TRUE), IF(NOT(ISBLANK(テーブル63[[#This Row],[許可区分(電気)]])),\"D\",\"-\"))","v":"-"},{"$f":"IF(NOT(ISBLANK(テーブル63[[#This Row],[水道施設]])),VLOOKUP(テーブル63[[#This Row],[水道施設]],水道[],2,TRUE), IF(NOT(ISBLANK(テーブル63[[#This Row],[許可区分（水道施設）]])),\"D\",\"-\"))","v":"C"}]
[13,"県内","竹内建設㈱","印西市竜腹寺598-2","竹内　一雅","0476-97-1133","0476-97-1508","特定",1109,"特定",968,null,null,"特定",882,"特定",935,"特定",859,"特定",750,null,null,null,null,"特定",750,{"$f":"IF(NOT(ISBLANK(テーブル63[[#This Row],[土木一式]])),VLOOKUP(テーブル63[[#This Row],[土木一式]],土木[],2,TRUE), IF(NOT(ISBLANK(テーブル63[[#This Row],[許可区分(土木)]])),\"D\",\"-\"))","v":"A"},{"$f":"IF(NOT(ISBLANK(テーブル63[[#This Row],[建築一式]])),VLOOKUP(テーブル63[[#This Row],[建築一式]],建築[],2,TRUE), IF(NOT(ISBLANK(テーブル63[[#This Row],[許可区分（建築）]])),\"D\",\"-\"))","v":"A"},{"$f":"IF(NOT(ISBLANK(テーブル63[[#This Row],[電気]])),VLOOKUP(テーブル63[[#This Row],[電気]],電気[],2,TRUE), IF(NOT(ISBLANK(テーブル63[[#This Row],[許可区分（電気）]])),\"D\",\"-\"))","v":"-"},{"$f":"IF(NOT(ISBLANK(テーブル63[[#This Row],[管]])),VLOOKUP(テーブル63[[#This Row],[管]],管[],2,TRUE), IF(NOT(ISBLANK(テーブル63[[#This Row],[許可区分（管）]])),\"D\",\"-\"))","v":"A"},{"$f":"IF(NOT(ISBLANK(テーブル63[[#This Row],[ほ装]])),VLOOKUP(テーブル63[[#This Row],[ほ装]],ほ装[],2,TRUE), IF(NOT(ISBLANK(テーブル63[[#This Row],[許可区分(ほ装)]])),\"D\",\"-\"))","v":"A"},{"$f":"IF(NOT(ISBLANK(テーブル63[[#This Row],[塗装]])),VLOOKUP(テーブル63[[#This Row],[塗装]],塗装[],2,TRUE), IF(NOT(ISBLANK(テーブル63[[#This Row],[許可区分（塗装）]])),\"D\",\"-\"))","v":"A"},{"$f":"IF(NOT(ISBLANK(テーブル63[[#This Row],[防水]])),VLOOKUP(テーブル63[[#This Row],[防水]],塗装[],2,TRUE), IF(NOT(ISBLANK(テーブル63[[#This Row],[許可区分（防水）]])),\"D\",\"-\"))","v":"B"},{"$f":"IF(NOT(ISBLANK(テーブル63[[#This Row],[機械器具設置]])),VLOOKUP(テーブル63[[#This Row],[機械器具設置]],塗装[],2,TRUE), IF(NOT(ISBLANK(テーブル63[[#This Row],[許可区分（機械器具）]])),\"D\",\"-\"))","v":"-"},{"$f":"IF(NOT(ISBLANK(テーブル63[[#This Row],[電気通信]])),VLOOKUP(テーブル63[[#This Row],[電気通信]],電気[],2,TRUE), IF(NOT(ISBLANK(テーブル63[[#This Row],[許可区分(電気)]])),\"D\",\"-\"))","v":"-"},{"$f":"IF(NOT(ISBLANK(テーブル63[[#This Row],[水道施設]])),VLOOKUP(テーブル63[[#This Row],[水道施設]],水道[],2,TRUE), IF(NOT(ISBLANK(テーブル63[[#This Row],[許可区分（水道施設）]])),\"D\",\"-\"))","v":"B"}]
[14,"県内","㈱大松建設　","成田市西三里塚1-63","吉川　洋己","0476-33-6663","0476-35-5055","特定",990,"特定",1006,null,null,null,null,"特定",848,null,null,null,null,null,null,null,null,"特定",732,{"$f":"IF(NOT(ISBLANK(テーブル63[[#This Row],[土木一式]])),VLOOKUP(テーブル63[[#This Row],[土木一式]],土木[],2,TRUE), IF(NOT(ISBLANK(テーブル63[[#This Row],[許可区分(土木)]])),\"D\",\"-\"))","v":"A"},{"$f":"IF(NOT(ISBLANK(テーブル63[[#This Row],[建築一式]])),VLOOKUP(テーブル63[[#This Row],[建築一式]],建築[],2,TRUE), IF(NOT(ISBLANK(テーブル63[[#This Row],[許可区分（建築）]])),\"D\",\"-\"))","v":"A"},{"$f":"IF(NOT(ISBLANK(テーブル63[[#This Row],[電気]])),VLOOKUP(テーブル63[[#This Row],[電気]],電気[],2,TRUE), IF(NOT(ISBLANK(テーブル63[[#This Row],[許可区分（電気）]])),\"D\",\"-\"))","v":"-"},{"$f":"IF(NOT(ISBLANK(テーブル63[[#This Row],[管]])),VLOOKUP(テーブル63[[#This Row],[管]],管[],2,TRUE), IF(NOT(ISBLANK(テーブル63[[#This Row],[許可区分（管）]])),\"D\",\"-\"))","v":"-"},{"$f":"IF(NOT(ISBLANK(テーブル63[[#This Row],[ほ装]])),VLOOKUP(テーブル63[[#This Row],[ほ装]],ほ装[],2,TRUE), IF(NOT(ISBLANK(テーブル63[[#This Row],[許可区分(ほ装)]])),\"D\",\"-\"))","v":"A"},{"$f":"IF(NOT(ISBLANK(テーブル63[[#This Row],[塗装]])),VLOOKUP(テーブル63[[#This Row],[塗装]],塗装[],2,TRUE), IF(NOT(ISBLANK(テーブル63[[#This Row],[許可区分（塗装）]])),\"D\",\"-\"))","v":"-"},{"$f":"IF(NOT(ISBLANK(テーブル63[[#This Row],[防水]])),VLOOKUP(テーブル63[[#This Row],[防水]],塗装[],2,TRUE), IF(NOT(ISBLANK(テーブル63[[#This Row],[許可区分（防水）]])),\"D\",\"-\"))","v":"-"},{"$f":"IF(NOT(ISBLANK(テーブル63[[#This Row],[機械器具設置]])),VLOOKUP(テーブル63[[#This Row],[機械器具設置]],塗装[],2,TRUE), IF(NOT(ISBLANK(テーブル63[[#This Row],[許可区分（機械器具）]])),\"D\",\"-\"))","v":"-"},{"$f":"IF(NOT(ISBLANK(テーブル63[[#This Row],[電気通信]])),VLOOKUP(テーブル63[[#This Row],[電気通信]],電気[],2,TRUE), IF(NOT(ISBLANK(テーブル63[[#This Row],[許可区分(電気)]])),\"D\",\"-\"))","v":"-"},{"$f":"IF(NOT(ISBLANK(テーブル63[[#This Row],[水道施設]])),VLOOKUP(テーブル63[[#This Row],[水道施設]],水道[],2,TRUE), IF(NOT(ISBLANK(テーブル63[[#This Row],[許可区分（水道施設）]])),\"D\",\"-\"))","v":"B"}]
[15,"県内","阿部建設㈱","旭市ニ528","阿部　典義","0479-62-1221","0479-63-7171","特定",1087,"特定",1141,"特定",738,"特定",828,"特定",987,null,null,null,null,null,null,null,null,"特定",886,{"$f":"IF(NOT(ISBLANK(テーブル63[[#This Row],[土木一式]])),VLOOKUP(テーブル63[[#This Row],[土木一式]],土木[],2,TRUE), IF(NOT(ISBLANK(テーブル63[[#This Row],[許可区分(土木)]])),\"D\",\"-\"))","v":"A"},{"$f":"IF(NOT(ISBLANK(テーブル63[[#This Row],[建築一式]])),VLOOKUP(テーブル63[[#This Row],[建築一式]],建築[],2,TRUE), IF(NOT(ISBLANK(テーブル63[[#This Row],[許可区分（建築）]])),\"D\",\"-\"))","v":"A"},{"$f":"IF(NOT(ISBLANK(テーブル63[[#This Row],[電気]])),VLOOKUP(テーブル63[[#This Row],[電気]],電気[],2,TRUE), IF(NOT(ISBLANK(テーブル63[[#This Row],[許可区分（電気）]])),\"D\",\"-\"))","v":"B"},{"$f":"IF(NOT(ISBLANK(テーブル63[[#This Row],[管]])),VLOOKUP(テーブル63[[#This Row],[管]],管[],2,TRUE), IF(NOT(ISBLANK(テーブル63[[#This Row],[許可区分（管）]])),\"D\",\"-\"))","v":"A"},{"$f":"IF(NOT(ISBLANK(テーブル63[[#This Row],[ほ装]])),VLOOKUP(テーブル63[[#This Row],[ほ装]],ほ装[],2,TRUE), IF(NOT(ISBLANK(テーブル63[[#This Row],[許可区分(ほ装)]])),\"D\",\"-\"))","v":"A"},{"$f":"IF(NOT(ISBLANK(テーブル63[[#This Row],[塗装]])),VLOOKUP(テーブル63[[#This Row],[塗装]],塗装[],2,TRUE), IF(NOT(ISBLANK(テーブル63[[#This Row],[許可区分（塗装）]])),\"D\",\"-\"))","v":"-"},{"$f":"IF(NOT(ISBLANK(テーブル63[[#This Row],[防水]])),VLOOKUP(テーブル63[[#This Row],[防水]],塗装[],2,TRUE), IF(NOT(ISBLANK(テーブル63[[#This Row],[許可区分（防水）]])),\"D\",\"-\"))","v":"-"},{"$f":"IF(NOT(ISBLANK(テーブル63[[#This Row],[機械器具設置]])),VLOOKUP(テーブル63[[#This Row],[機械器具設置]],塗装[],2,TRUE), IF(NOT(ISBLANK(テーブル63[[#This Row],[許可区分（機械器具）]])),\"D\",\"-\"))","v":"-"},{"$f":"IF(NOT(ISBLANK(テーブル63[[#This Row],[電気通信]])),VLOOKUP(テーブル63[[#This Row],[電気通信]],電気[],2,TRUE), IF(NOT(ISBLANK(テーブル63[[#This Row],[許可区分(電気)]])),\"D\",\"-\"))","v":"-"},{"$f":"IF(NOT(ISBLANK(テーブル63[[#This Row],[水道施設]])),VLOOKUP(テーブル63[[#This Row],[水道施設]],水道[],2,TRUE), IF(NOT(ISBLANK(テーブル63[[#This Row],[許可区分（水道施設）]])),\"D\",\"-\"))","v":"A"}]
[16,"県内","飛鳥建設㈱　千葉営業所","千葉市中央区登戸1-26-1","礒﨑　保雄","043-238-8601","043-238-9581","特定",1770,"特定",1706,null,null,null,null,"特定",1072,null,null,null,null,null,null,null,null,"特定",1364,{"$f":"IF(NOT(ISBLANK(テーブル63[[#This Row],[土木一式]])),VLOOKUP(テーブル63[[#This Row],[土木一式]],土木[],2,TRUE), IF(NOT(ISBLANK(テーブル63[[#This Row],[許可区分(土木)]])),\"D\",\"-\"))","v":"A"},{"$f":"IF(NOT(ISBLANK(テーブル63[[#This Row],[建築一式]])),VLOOKUP(テーブル63[[#This Row],[建築一式]],建築[],2,TRUE), IF(NOT(ISBLANK(テーブル63[[#This Row],[許可区分（建築）]])),\"D\",\"-\"))","v":"A"},{"$f":"IF(NOT(ISBLANK(テーブル63[[#This Row],[電気]])),VLOOKUP(テーブル63[[#This Row],[電気]],電気[],2,TRUE), IF(NOT(ISBLANK(テーブル63[[#This Row],[許可区分（電気）]])),\"D\",\"-\"))","v":"-"},{"$f":"IF(NOT(ISBLANK(テーブル63[[#This Row],[管]])),VLOOKUP(テーブル63[[#This Row],[管]],管[],2,TRUE), IF(NOT(ISBLANK(テーブル63[[#This Row],[許可区分（管）]])),\"D\",\"-\"))","v":"-"},{"$f":"IF(NOT(ISBLANK(テーブル63[[#This Row],[ほ装]])),VLOOKUP(テーブル63[[#This Row],[ほ装]],ほ装[],2,TRUE), IF(NOT(ISBLANK(テーブル63[[#This Row],[許可区分(ほ装)]])),\"D\",\"-\"))","v":"A"},{"$f":"IF(NOT(ISBLANK(テーブル63[[#This Row],[塗装]])),VLOOKUP(テーブル63[[#This Row],[塗装]],塗装[],2,TRUE), IF(NOT(ISBLANK(テーブル63[[#This Row],[許可区分（塗装）]])),\"D\",\"-\"))","v":"-"},{"$f":"IF(NOT(ISBLANK(テーブル63[[#This Row],[防水]])),VLOOKUP(テーブル63[[#This Row],[防水]],塗装[],2,TRUE), IF(NOT(ISBLANK(テーブル63[[#This Row],[許可区分（防水）]])),\"D\",\"-\"))","v":"-"},{"$f":"IF(NOT(ISBLANK(テーブル63[[#This Row],[機械器具設置]])),VLOOKUP(テーブル63[[#This Row],[機械器具設置]],塗装[],2,TRUE), IF(NOT(ISBLANK(テーブル63[[#This Row],[許可区分（機械器具）]])),\"D\",\"-\"))","v":"-"},{"$f":"IF(NOT(ISBLANK(テーブル63[[#This Row],[電気通信]])),VLOOKUP(テーブル63[[#This Row],[電気通信]],電気[],2,TRUE), IF(NOT(ISBLANK(テーブル63[[#This Row],[許可区分(電気)]])),\"D\",\"-\"))","v":"-"},{"$f":"IF(NOT(ISBLANK(テーブル63[[#This Row],[水道施設]])),VLOOKUP(テーブル63[[#This Row],[水道施設]],水道[],2,TRUE), IF(NOT(ISBLANK(テーブル63[[#This Row],[許可区分（水道施設）]])),\"D\",\"-\"))","v":"A"}]
[17,"県内","鎌形建設㈱","香取郡多古町多古591","鎌形　憲一","0479-76-2225","0479-76-2260","特定",996,"特定",1137,null,null,"特定",795,"特定",931,"特定",824,"特定",785,null,null,null,null,"特定",806,{"$f":"IF(NOT(ISBLANK(テーブル63[[#This Row],[土木一式]])),VLOOKUP(テーブル63[[#This Row],[土木一式]],土木[],2,TRUE), IF(NOT(ISBLANK(テーブル63[[#This Row],[許可区分(土木)]])),\"D\",\"-\"))","v":"A"},{"$f":"IF(NOT(ISBLANK(テーブル63[[#This Row],[建築一式]])),VLOOKUP(テーブル63[[#This Row],[建築一式]],建築[],2,TRUE), IF(NOT(ISBLANK(テーブル63[[#This Row],[許可区分（建築）]])),\"D\",\"-\"))","v":"A"},{"$f":"IF(NOT(ISBLANK(テーブル63[[#This Row],[電気]])),VLOOKUP(テーブル63[[#This Row],[電気]],電気[],2,TRUE), IF(NOT(ISBLANK(テーブル63[[#This Row],[許可区分（電気）]])),\"D\",\"-\"))","v":"-"},{"$f":"IF(NOT(ISBLANK(テーブル63[[#This Row],[管]])),VLOOKUP(テーブル63[[#This Row],[管]],管[],2,TRUE), IF(NOT(ISBLANK(テーブル63[[#This Row],[許可区分（管）]])),\"D\",\"-\"))","v":"A"},{"$f":"IF(NOT(ISBLANK(テーブル63[[#This Row],[ほ装]])),VLOOKUP(テーブル63[[#This Row],[ほ装]],ほ装[],2,TRUE), IF(NOT(ISBLANK(テーブル63[[#This Row],[許可区分(ほ装)]])),\"D\",\"-\"))","v":"A"},{"$f":"IF(NOT(ISBLANK(テーブル63[[#This Row],[塗装]])),VLOOKUP(テーブル63[[#This Row],[塗装]],塗装[],2,TRUE), IF(NOT(ISBLANK(テーブル63[[#This Row],[許可区分（塗装）]])),\"D\",\"-\"))","v":"A"},{"$f":"IF(NOT(ISBLANK(テーブル63[[#This Row],[防水]])),VLOOKUP(テーブル63[[#This Row],[防水]],塗装[],2,TRUE), IF(NOT(ISBLANK(テーブル63[[#This Row],[許可区分（防水）]])),\"D\",\"-\"))","v":"B"},{"$f":"IF(NOT(ISBLANK(テーブル63[[#This Row],[機械器具設置]])),VLOOKUP(テーブル63[[#This Row],[機械器具設置]],塗装[],2,TRUE), IF(NOT(ISBLANK(テーブル63[[#This Row],[許可区分（機械器具）]])),\"D\",\"-\"))","v":"-"},{"$f":"IF(NOT(ISBLANK(テーブル63[[#This Row],[電気通信]])),VLOOKUP(テーブル63[[#This Row],[電気通信]],電気[],2,TRUE), IF(NOT(ISBLANK(テーブル63[[#This Row],[許可区分(電気)]])),\"D\",\"-\"))","v":"-"},{"$f":"IF(NOT(ISBLANK(テーブル63[[#This Row],[水道施設]])),VLOOKUP(テーブル63[[#This Row],[水道施設]],水道[],2,TRUE), IF(NOT(ISBLANK(テーブル63[[#This Row],[許可区分（水道施設）]])),\"D\",\"-\"))","v":"A"}]
[18,"県内","㈱今井組","銚子市長塚町4-1157","今井　敏春","0479-23-6588","0479-25-2075","特定",1008,null,null,null,null,null,null,"特定",876,null,null,null,null,null,null,null,null,"特定",718,{"$f":"IF(NOT(ISBLANK(テーブル63[[#This Row],[土木一式]])),VLOOKUP(テーブル63[[#This Row],[土木一式]],土木[],2,TRUE), IF(NOT(ISBLANK(テーブル63[[#This Row],[許可区分(土木)]])),\"D\",\"-\"))","v":"A"},{"$f":"IF(NOT(ISBLANK(テーブル63[[#This Row],[建築一式]])),VLOOKUP(テーブル63[[#This Row],[建築一式]],建築[],2,TRUE), IF(NOT(ISBLANK(テーブル63[[#This Row],[許可区分（建築）]])),\"D\",\"-\"))","v":"-"},{"$f":"IF(NOT(ISBLANK(テーブル63[[#This Row],[電気]])),VLOOKUP(テーブル63[[#This Row],[電気]],電気[],2,TRUE), IF(NOT(ISBLANK(テーブル63[[#This Row],[許可区分（電気）]])),\"D\",\"-\"))","v":"-"},{"$f":"IF(NOT(ISBLANK(テーブル63[[#This Row],[管]])),VLOOKUP(テーブル63[[#This Row],[管]],管[],2,TRUE), IF(NOT(ISBLANK(テーブル63[[#This Row],[許可区分（管）]])),\"D\",\"-\"))","v":"-"},{"$f":"IF(NOT(ISBLANK(テーブル63[[#This Row],[ほ装]])),VLOOKUP(テーブル63[[#This Row],[ほ装]],ほ装[],2,TRUE), IF(NOT(ISBLANK(テーブル63[[#This Row],[許可区分(ほ装)]])),\"D\",\"-\"))","v":"A"},{"$f":"IF(NOT(ISBLANK(テーブル63[[#This Row],[塗装]])),VLOOKUP(テーブル63[[#This Row],[塗装]],塗装[],2,TRUE), IF(NOT(ISBLANK(テーブル63[[#This Row],[許可区分（塗装）]])),\"D\",\"-\"))","v":"-"},{"$f":"IF(NOT(ISBLANK(テーブル63[[#This Row],[防水]])),VLOOKUP(テーブル63[[#This Row],[防水]],塗装[],2,TRUE), IF(NOT(ISBLANK(テーブル63[[#This Row],[許可区分（防水）]])),\"D\",\"-\"))","v":"-"},{"$f":"IF(NOT(ISBLANK(テーブル63[[#This Row],[機械器具設置]])),VLOOKUP(テーブル63[[#This Row],[機械器具設置]],塗装[],2,TRUE), IF(NOT(ISBLANK(テーブル63[[#This Row],[許可区分（機械器具）]])),\"D\",\"-\"))","v":"-"},{"$f":"IF(NOT(ISBLANK(テーブル63[[#This Row],[電気通信]])),VLOOKUP(テーブル63[[#This Row],[電気通信]],電気[],2,TRUE), IF(NOT(ISBLANK(テーブル63[[#This Row],[許可区分(電気)]])),\"D\",\"-\"))","v":"-"},{"$f":"IF(NOT(ISBLANK(テーブル63[[#This Row],[水道施設]])),VLOOKUP(テーブル63[[#This Row],[水道施設]],水道[],2,TRUE), IF(NOT(ISBLANK(テーブル63[[#This Row],[許可区分（水道施設）]])),\"D\",\"-\"))","v":"B"}]
[19,"県内","伊藤仁塗装㈱","千葉市中央区市場町3-4","伊藤　伸一","043-222-7825","043-224-2486",null,null,null,null,null,null,null,null,null,null,"特定",874,"特定",749,null,null,null,null,null,null,{"$f":"IF(NOT(ISBLANK(テーブル63[[#This Row],[土木一式]])),VLOOKUP(テーブル63[[#This Row],[土木一式]],土木[],2,TRUE), IF(NOT(ISBLANK(テーブル63[[#This Row],[許可区分(土木)]])),\"D\",\"-\"))","v":"-"},{"$f":"IF(NOT(ISBLANK(テーブル63[[#This Row],[建築一式]])),VLOOKUP(テーブル63[[#This Row],[建築一式]],建築[],2,TRUE), IF(NOT(ISBLANK(テーブル63[[#This Row],[許可区分（建築）]])),\"D\",\"-\"))","v":"-"},{"$f":"IF(NOT(ISBLANK(テーブル63[[#This Row],[電気]])),VLOOKUP(テーブル63[[#This Row],[電気]],電気[],2,TRUE), IF(NOT(ISBLANK(テーブル63[[#This Row],[許可区分（電気）]])),\"D\",\"-\"))","v":"-"},{"$f":"IF(NOT(ISBLANK(テーブル63[[#This Row],[管]])),VLOOKUP(テーブル63[[#This Row],[管]],管[],2,TRUE), IF(NOT(ISBLANK(テーブル63[[#This Row],[許可区分（管）]])),\"D\",\"-\"))","v":"-"},{"$f":"IF(NOT(ISBLANK(テーブル63[[#This Row],[ほ装]])),VLOOKUP(テーブル63[[#This Row],[ほ装]],ほ装[],2,TRUE), IF(NOT(ISBLANK(テーブル63[[#This Row],[許可区分(ほ装)]])),\"D\",\"-\"))","v":"-"},{"$f":"IF(NOT(ISBLANK(テーブル63[[#This Row],[塗装]])),VLOOKUP(テーブル63[[#This Row],[塗装]],塗装[],2,TRUE), IF(NOT(ISBLANK(テーブル63[[#This Row],[許可区分（塗装）]])),\"D\",\"-\"))","v":"A"},{"$f":"IF(NOT(ISBLANK(テーブル63[[#This Row],[防水]])),VLOOKUP(テーブル63[[#This Row],[防水]],塗装[],2,TRUE), IF(NOT(ISBLANK(テーブル63[[#This Row],[許可区分（防水）]])),\"D\",\"-\"))","v":"B"},{"$f":"IF(NOT(ISBLANK(テーブル63[[#This Row],[機械器具設置]])),VLOOKUP(テーブル63[[#This Row],[機械器具設置]],塗装[],2,TRUE), IF(NOT(ISBLANK(テーブル63[[#This Row],[許可区分（機械器具）]])),\"D\",\"-\"))","v":"-"},{"$f":"IF(NOT(ISBLANK(テーブル63[[#This Row],[電気通信]])),VLOOKUP(テーブル63[[#This Row],[電気通信]],電気[],2,TRUE), IF(NOT(ISBLANK(テーブル63[[#This Row],[許可区分(電気)]])),\"D\",\"-\"))","v":"-"},{"$f":"IF(NOT(ISBLANK(テーブル63[[#This Row],[水道施設]])),VLOOKUP(テーブル63[[#This Row],[水道施設]],水道[],2,TRUE), IF(NOT(ISBLANK(テーブル63[[#This Row],[許可区分（水道施設）]])),\"D\",\"-\"))","v":"-"}]
[20,"県内","㈱鴻池組　千葉営業所","千葉市中央区新町18-12","秋山　功志","043-238-5901","043-238-5902","特定",1819,"特定",1890,null,null,null,null,null,null,null,null,null,null,null,null,null,null,"特定",1490,{"$f":"IF(NOT(ISBLANK(テーブル63[[#This Row],[土木一式]])),VLOOKUP(テーブル63[[#This Row],[土木一式]],土木[],2,TRUE), IF(NOT(ISBLANK(テーブル63[[#This Row],[許可区分(土木)]])),\"D\",\"-\"))","v":"A"},{"$f":"IF(NOT(ISBLANK(テーブル63[[#This Row],[建築一式]])),VLOOKUP(テーブル63[[#This Row],[建築一式]],建築[],2,TRUE), IF(NOT(ISBLANK(テーブル63[[#This Row],[許可区分（建築）]])),\"D\",\"-\"))","v":"A"},{"$f":"IF(NOT(ISBLANK(テーブル63[[#This Row],[電気]])),VLOOKUP(テーブル63[[#This Row],[電気]],電気[],2,TRUE), IF(NOT(ISBLANK(テーブル63[[#This Row],[許可区分（電気）]])),\"D\",\"-\"))","v":"-"},{"$f":"IF(NOT(ISBLANK(テーブル63[[#This Row],[管]])),VLOOKUP(テーブル63[[#This Row],[管]],管[],2,TRUE), IF(NOT(ISBLANK(テーブル63[[#This Row],[許可区分（管）]])),\"D\",\"-\"))","v":"-"},{"$f":"IF(NOT(ISBLANK(テーブル63[[#This Row],[ほ装]])),VLOOKUP(テーブル63[[#This Row],[ほ装]],ほ装[],2,TRUE), IF(NOT(ISBLANK(テーブル63[[#This Row],[許可区分(ほ装)]])),\"D\",\"-\"))","v":"-"},{"$f":"IF(NOT(ISBLANK(テーブル63[[#This Row],[塗装]])),VLOOKUP(テーブル63[[#This Row],[塗装]],塗装[],2,TRUE), IF(NOT(ISBLANK(テーブル63[[#This Row],[許可区分（塗装）]])),\"D\",\"-\"))","v":"-"},{"$f":"IF(NOT(ISBLANK(テーブル63[[#This Row],[防水]])),VLOOKUP(テーブル63[[#This Row],[防水]],塗装[],2,TRUE), IF(NOT(ISBLANK(テーブル63[[#This Row],[許可区分（防水）]])),\"D\",\"-\"))","v":"-"},{"$f":"IF(NOT(ISBLANK(テーブル63[[#This Row],[機械器具設置]])),VLOOKUP(テーブル63[[#This Row],[機械器具設置]],塗装[],2,TRUE), IF(NOT(ISBLANK(テーブル63[[#This Row],[許可区分（機械器具）]])),\"D\",\"-\"))","v":"-"},{"$f":"IF(NOT(ISBLANK(テーブル63[[#This Row],[電気通信]])),VLOOKUP(テーブル63[[#This Row],[電気通信]],電気[],2,TRUE), IF(NOT(ISBLANK(テーブル63[[#This Row],[許可区分(電気)]])),\"D\",\"-\"))","v":"-"},{"$f":"IF(NOT(ISBLANK(テーブル63[[#This Row],[水道施設]])),VLOOKUP(テーブル63[[#This Row],[水道施設]],水道[],2,TRUE), IF(NOT(ISBLANK(テーブル63[[#This Row],[許可区分（水道施設）]])),\"D\",\"-\"))","v":"A"}]
[21,"県内","㈲西川塗装店","千葉市稲毛区園生町406-64","西川　昇","043-284-0808","043-284-0080",null,null,"特定",745,null,null,null,null,null,null,"特定",883,"特定",823,null,null,null,null,null,null,{"$f":"IF(NOT(ISBLANK(テーブル63[[#This Row],[土木一式]])),VLOOKUP(テーブル63[[#This Row],[土木一式]],土木[],2,TRUE), IF(NOT(ISBLANK(テーブル63[[#This Row],[許可区分(土木)]])),\"D\",\"-\"))","v":"-"},{"$f":"IF(NOT(ISBLANK(テーブル63[[#This Row],[建築一式]])),VLOOKUP(テーブル63[[#This Row],[建築一式]],建築[],2,TRUE), IF(NOT(ISBLANK(テーブル63[[#This Row],[許可区分（建築）]])),\"D\",\"-\"))","v":"B"},{"$f":"IF(NOT(ISBLANK(テーブル63[[#This Row],[電気]])),VLOOKUP(テーブル63[[#This Row],[電気]],電気[],2,TRUE), IF(NOT(ISBLANK(テーブル63[[#This Row],[許可区分（電気）]])),\"D\",\"-\"))","v":"-"},{"$f":"IF(NOT(ISBLANK(テーブル63[[#This Row],[管]])),VLOOKUP(テーブル63[[#This Row],[管]],管[],2,TRUE), IF(NOT(ISBLANK(テーブル63[[#This Row],[許可区分（管）]])),\"D\",\"-\"))","v":"-"},{"$f":"IF(NOT(ISBLANK(テーブル63[[#This Row],[ほ装]])),VLOOKUP(テーブル63[[#This Row],[ほ装]],ほ装[],2,TRUE), IF(NOT(ISBLANK(テーブル63[[#This Row],[許可区分(ほ装)]])),\"D\",\"-\"))","v":"-"},{"$f":"IF(NOT(ISBLANK(テーブル63[[#This Row],[塗装]])),VLOOKUP(テーブル63[[#This Row],[塗装]],塗装[],2,TRUE), IF(NOT(ISBLANK(テーブル63[[#This Row],[許可区分（塗装）]])),\"D\",\"-\"))","v":"A"},{"$f":"IF(NOT(ISBLANK(テーブル63[[#This Row],[防水]])),VLOOKUP(テーブル63[[#This Row],[防水]],塗装[],2,TRUE), IF(NOT(ISBLANK(テーブル63[[#This Row],[許可区分（防水）]])),\"D\",\"-\"))","v":"A"},{"$f":"IF(NOT(ISBLANK(テーブル63[[#This Row],[機械器具設置]])),VLOOKUP(テーブル63[[#This Row],[機械器具設置]],塗装[],2,TRUE), IF(NOT(ISBLANK(テーブル63[[#This Row],[許可区分（機械器具）]])),\"D\",\"-\"))","v":"-"},{"$f":"IF(NOT(ISBLANK(テーブル63[[#This Row],[電気通信]])),VLOOKUP(テーブル63[[#This Row],[電気通信]],電気[],2,TRUE), IF(NOT(ISBLANK(テーブル63[[#This Row],[許可区分(電気)]])),\"D\",\"-\"))","v":"-"},{"$f":"IF(NOT(ISBLANK(テーブル63[[#This Row],[水道施設]])),VLOOKUP(テーブル63[[#This Row],[水道施設]],水道[],2,TRUE), IF(NOT(ISBLANK(テーブル63[[#This Row],[許可区分（水道施設）]])),\"D\",\"-\"))","v":"-"}]
[33,"県外","水ingエンジニアリング㈱　東関東営業所","千葉市中央区富士見2-15-11","小関　純一","043-227-1350","043-227-1360","特定",846,null,null,"特定",965,"特定",925,null,null,"特定",831,null,null,"特定",1227,null,null,"特定",1263,{"$f":"IF(NOT(ISBLANK(テーブル63[[#This Row],[土木一式]])),VLOOKUP(テーブル63[[#This Row],[土木一式]],土木[],2,TRUE), IF(NOT(ISBLANK(テーブル63[[#This Row],[許可区分(土木)]])),\"D\",\"-\"))","v":"A"},{"$f":"IF(NOT(ISBLANK(テーブル63[[#This Row],[建築一式]])),VLOOKUP(テーブル63[[#This Row],[建築一式]],建築[],2,TRUE), IF(NOT(ISBLANK(テーブル63[[#This Row],[許可区分（建築）]])),\"D\",\"-\"))","v":"-"},{"$f":"IF(NOT(ISBLANK(テーブル63[[#This Row],[電気]])),VLOOKUP(テーブル63[[#This Row],[電気]],電気[],2,TRUE), IF(NOT(ISBLANK(テーブル63[[#This Row],[許可区分（電気）]])),\"D\",\"-\"))","v":"A"},{"$f":"IF(NOT(ISBLANK(テーブル63[[#This Row],[管]])),VLOOKUP(テーブル63[[#This Row],[管]],管[],2,TRUE), IF(NOT(ISBLANK(テーブル63[[#This Row],[許可区分（管）]])),\"D\",\"-\"))","v":"A"},{"$f":"IF(NOT(ISBLANK(テーブル63[[#This Row],[ほ装]])),VLOOKUP(テーブル63[[#This Row],[ほ装]],ほ装[],2,TRUE), IF(NOT(ISBLANK(テーブル63[[#This Row],[許可区分(ほ装)]])),\"D\",\"-\"))","v":"-"},{"$f":"IF(NOT(ISBLANK(テーブル63[[#This Row],[塗装]])),VLOOKUP(テーブル63[[#This Row],[塗装]],塗装[],2,TRUE), IF(NOT(ISBLANK(テーブル63[[#This Row],[許可区分（塗装）]])),\"D\",\"-\"))","v":"A"},{"$f":"IF(NOT(ISBLANK(テーブル63[[#This Row],[防水]])),VLOOKUP(テーブル63[[#This Row],[防水]],塗装[],2,TRUE), IF(NOT(ISBLANK(テーブル63[[#This Row],[許可区分（防水）]])),\"D\",\"-\"))","v":"-"},{"$f":"IF(NOT(ISBLANK(テーブル63[[#This Row],[機械器具設置]])),VLOOKUP(テーブル63[[#This Row],[機械器具設置]],塗装[],2,TRUE), IF(NOT(ISBLANK(テーブル63[[#This Row],[許可区分（機械器具）]])),\"D\",\"-\"))","v":"A"},{"$f":"IF(NOT(ISBLANK(テーブル63[[#This Row],[電気通信]])),VLOOKUP(テーブル63[[#This Row],[電気通信]],電気[],2,TRUE), IF(NOT(ISBLANK(テーブル63[[#This Row],[許可区分(電気)]])),\"D\",\"-\"))","v":"-"},{"$f":"IF(NOT(ISBLANK(テーブル63[[#This Row],[水道施設]])),VLOOKUP(テーブル63[[#This Row],[水道施設]],水道[],2,TRUE), IF(NOT(ISBLANK(テーブル63[[#This Row],[許可区分（水道施設）]])),\"D\",\"-\"))","v":"A"}]
[23,"県内","前田建設工業㈱　千葉営業所","千葉市中央区中央1-11-1","西　昭彦","043-222-9417","043-227-3251","特定",1963,"特定",1965,null,null,null,null,null,null,null,null,null,null,null,null,null,null,"特定",1545,{"$f":"IF(NOT(ISBLANK(テーブル63[[#This Row],[土木一式]])),VLOOKUP(テーブル63[[#This Row],[土木一式]],土木[],2,TRUE), IF(NOT(ISBLANK(テーブル63[[#This Row],[許可区分(土木)]])),\"D\",\"-\"))","v":"A"},{"$f":"IF(NOT(ISBLANK(テーブル63[[#This Row],[建築一式]])),VLOOKUP(テーブル63[[#This Row],[建築一式]],建築[],2,TRUE), IF(NOT(ISBLANK(テーブル63[[#This Row],[許可区分（建築）]])),\"D\",\"-\"))","v":"A"},{"$f":"IF(NOT(ISBLANK(テーブル63[[#This Row],[電気]])),VLOOKUP(テーブル63[[#This Row],[電気]],電気[],2,TRUE), IF(NOT(ISBLANK(テーブル63[[#This Row],[許可区分（電気）]])),\"D\",\"-\"))","v":"-"},{"$f":"IF(NOT(ISBLANK(テーブル63[[#This Row],[管]])),VLOOKUP(テーブル63[[#This Row],[管]],管[],2,TRUE), IF(NOT(ISBLANK(テーブル63[[#This Row],[許可区分（管）]])),\"D\",\"-\"))","v":"-"},{"$f":"IF(NOT(ISBLANK(テーブル63[[#This Row],[ほ装]])),VLOOKUP(テーブル63[[#This Row],[ほ装]],ほ装[],2,TRUE), IF(NOT(ISBLANK(テーブル63[[#This Row],[許可区分(ほ装)]])),\"D\",\"-\"))","v":"-"},{"$f":"IF(NOT(ISBLANK(テーブル63[[#This Row],[塗装]])),VLOOKUP(テーブル63[[#This Row],[塗装]],塗装[],2,TRUE), IF(NOT(ISBLANK(テーブル63[[#This Row],[許可区分（塗装）]])),\"D\",\"-\"))","v":"-"},{"$f":"IF(NOT(ISBLANK(テーブル63[[#This Row],[防水]])),VLOOKUP(テーブル63[[#This Row],[防水]],塗装[],2,TRUE), IF(NOT(ISBLANK(テーブル63[[#This Row],[許可区分（防水）]])),\"D\",\"-\"))","v":"-"},{"$f":"IF(NOT(ISBLANK(テーブル63[[#This Row],[機械器具設置]])),VLOOKUP(テーブル63[[#This Row],[機械器具設置]],塗装[],2,TRUE), IF(NOT(ISBLANK(テーブル63[[#This Row],[許可区分（機械器具）]])),\"D\",\"-\"))","v":"-"},{"$f":"IF(NOT(ISBLANK(テーブル63[[#This Row],[電気通信]])),VLOOKUP(テーブル63[[#This Row],[電気通信]],電気[],2,TRUE), IF(NOT(ISBLANK(テーブル63[[#This Row],[許可区分(電気)]])),\"D\",\"-\"))","v":"-"},{"$f":"IF(NOT(ISBLANK(テーブル63[[#This Row],[水道施設]])),VLOOKUP(テーブル63[[#This Row],[水道施設]],水道[],2,TRUE), IF(NOT(ISBLANK(テーブル63[[#This Row],[許可区分（水道施設）]])),\"D\",\"-\"))","v":"A"}]
[24,"県内","古谷建設㈱","山武郡横芝光町栗山3195-1","古谷　務","0479-82-3311","0479-82-3314","特定",1184,"特定",1206,null,null,"特定",872,"特定",1050,null,null,null,null,null,null,null,null,"特定",789,{"$f":"IF(NOT(ISBLANK(テーブル63[[#This Row],[土木一式]])),VLOOKUP(テーブル63[[#This Row],[土木一式]],土木[],2,TRUE), IF(NOT(ISBLANK(テーブル63[[#This Row],[許可区分(土木)]])),\"D\",\"-\"))","v":"A"},{"$f":"IF(NOT(ISBLANK(テーブル63[[#This Row],[建築一式]])),VLOOKUP(テーブル63[[#This Row],[建築一式]],建築[],2,TRUE), IF(NOT(ISBLANK(テーブル63[[#This Row],[許可区分（建築）]])),\"D\",\"-\"))","v":"A"},{"$f":"IF(NOT(ISBLANK(テーブル63[[#This Row],[電気]])),VLOOKUP(テーブル63[[#This Row],[電気]],電気[],2,TRUE), IF(NOT(ISBLANK(テーブル63[[#This Row],[許可区分（電気）]])),\"D\",\"-\"))","v":"-"},{"$f":"IF(NOT(ISBLANK(テーブル63[[#This Row],[管]])),VLOOKUP(テーブル63[[#This Row],[管]],管[],2,TRUE), IF(NOT(ISBLANK(テーブル63[[#This Row],[許可区分（管）]])),\"D\",\"-\"))","v":"A"},{"$f":"IF(NOT(ISBLANK(テーブル63[[#This Row],[ほ装]])),VLOOKUP(テーブル63[[#This Row],[ほ装]],ほ装[],2,TRUE), IF(NOT(ISBLANK(テーブル63[[#This Row],[許可区分(ほ装)]])),\"D\",\"-\"))","v":"A"},{"$f":"IF(NOT(ISBLANK(テーブル63[[#This Row],[塗装]])),VLOOKUP(テーブル63[[#This Row],[塗装]],塗装[],2,TRUE), IF(NOT(ISBLANK(テーブル63[[#This Row],[許可区分（塗装）]])),\"D\",\"-\"))","v":"-"},{"$f":"IF(NOT(ISBLANK(テーブル63[[#This Row],[防水]])),VLOOKUP(テーブル63[[#This Row],[防水]],塗装[],2,TRUE), IF(NOT(ISBLANK(テーブル63[[#This Row],[許可区分（防水）]])),\"D\",\"-\"))","v":"-"},{"$f":"IF(NOT(ISBLANK(テーブル63[[#This Row],[機械器具設置]])),VLOOKUP(テーブル63[[#This Row],[機械器具設置]],塗装[],2,TRUE), IF(NOT(ISBLANK(テーブル63[[#This Row],[許可区分（機械器具）]])),\"D\",\"-\"))","v":"-"},{"$f":"IF(NOT(ISBLANK(テーブル63[[#This Row],[電気通信]])),VLOOKUP(テーブル63[[#This Row],[電気通信]],電気[],2,TRUE), IF(NOT(ISBLANK(テーブル63[[#This Row],[許可区分(電気)]])),\"D\",\"-\"))","v":"-"},{"$f":"IF(NOT(ISBLANK(テーブル63[[#This Row],[水道施設]])),VLOOKUP(テーブル63[[#This Row],[水道施設]],水道[],2,TRUE), IF(NOT(ISBLANK(テーブル63[[#This Row],[許可区分（水道施設）]])),\"D\",\"-\"))","v":"B"}]
[25,"県内","㈱明電舎　東関東支店","千葉市花見川区幕張本郷1-2-24","舟津　昌昭","043-273-6125","043-273-6128","特定",986,"特定",1049,"特定",1836,"特定",1147,null,null,null,null,null,null,"特定",1250,"特定",1367,"特定",1284,{"$f":"IF(NOT(ISBLANK(テーブル63[[#This Row],[土木一式]])),VLOOKUP(テーブル63[[#This Row],[土木一式]],土木[],2,TRUE), IF(NOT(ISBLANK(テーブル63[[#This Row],[許可区分(土木)]])),\"D\",\"-\"))","v":"A"},{"$f":"IF(NOT(ISBLANK(テーブル63[[#This Row],[建築一式]])),VLOOKUP(テーブル63[[#This Row],[建築一式]],建築[],2,TRUE), IF(NOT(ISBLANK(テーブル63[[#This Row],[許可区分（建築）]])),\"D\",\"-\"))","v":"A"},{"$f":"IF(NOT(ISBLANK(テーブル63[[#This Row],[電気]])),VLOOKUP(テーブル63[[#This Row],[電気]],電気[],2,TRUE), IF(NOT(ISBLANK(テーブル63[[#This Row],[許可区分（電気）]])),\"D\",\"-\"))","v":"A"},{"$f":"IF(NOT(ISBLANK(テーブル63[[#This Row],[管]])),VLOOKUP(テーブル63[[#This Row],[管]],管[],2,TRUE), IF(NOT(ISBLANK(テーブル63[[#This Row],[許可区分（管）]])),\"D\",\"-\"))","v":"A"},{"$f":"IF(NOT(ISBLANK(テーブル63[[#This Row],[ほ装]])),VLOOKUP(テーブル63[[#This Row],[ほ装]],ほ装[],2,TRUE), IF(NOT(ISBLANK(テーブル63[[#This Row],[許可区分(ほ装)]])),\"D\",\"-\"))","v":"-"},{"$f":"IF(NOT(ISBLANK(テーブル63[[#This Row],[塗装]])),VLOOKUP(テーブル63[[#This Row],[塗装]],塗装[],2,TRUE), IF(NOT(ISBLANK(テーブル63[[#This Row],[許可区分（塗装）]])),\"D\",\"-\"))","v":"-"},{"$f":"IF(NOT(ISBLANK(テーブル63[[#This Row],[防水]])),VLOOKUP(テーブル63[[#This Row],[防水]],塗装[],2,TRUE), IF(NOT(ISBLANK(テーブル63[[#This Row],[許可区分（防水）]])),\"D\",\"-\"))","v":"-"},{"$f":"IF(NOT(ISBLANK(テーブル63[[#This Row],[機械器具設置]])),VLOOKUP(テーブル63[[#This Row],[機械器具設置]],塗装[],2,TRUE), IF(NOT(ISBLANK(テーブル63[[#This Row],[許可区分（機械器具）]])),\"D\",\"-\"))","v":"A"},{"$f":"IF(NOT(ISBLANK(テーブル63[[#This Row],[電気通信]])),VLOOKUP(テーブル63[[#This Row],[電気通信]],電気[],2,TRUE), IF(NOT(ISBLANK(テーブル63[[#This Row],[許可区分(電気)]])),\"D\",\"-\"))","v":"A"},{"$f":"IF(NOT(ISBLANK(テーブル63[[#This Row],[水道施設]])),VLOOKUP(テーブル63[[#This Row],[水道施設]],水道[],2,TRUE), IF(NOT(ISBLANK(テーブル63[[#This Row],[許可区分（水道施設）]])),\"D\",\"-\"))","v":"A"}]
[26,"県内","浦安電設㈱","船橋市栄町2-3-9","岡本　善徳","047-434-2310","047-432-1709","一般",681,null,null,"特定",946,"一般",677,null,null,null,null,null,null,null,null,null,null,null,null,{"$f":"IF(NOT(ISBLANK(テーブル63[[#This Row],[土木一式]])),VLOOKUP(テーブル63[[#This Row],[土木一式]],土木[],2,TRUE), IF(NOT(ISBLANK(テーブル63[[#This Row],[許可区分(土木)]])),\"D\",\"-\"))","v":"B"},{"$f":"IF(NOT(ISBLANK(テーブル63[[#This Row],[建築一式]])),VLOOKUP(テーブル63[[#This Row],[建築一式]],建築[],2,TRUE), IF(NOT(ISBLANK(テーブル63[[#This Row],[許可区分（建築）]])),\"D\",\"-\"))","v":"-"},{"$f":"IF(NOT(ISBLANK(テーブル63[[#This Row],[電気]])),VLOOKUP(テーブル63[[#This Row],[電気]],電気[],2,TRUE), IF(NOT(ISBLANK(テーブル63[[#This Row],[許可区分（電気）]])),\"D\",\"-\"))","v":"A"},{"$f":"IF(NOT(ISBLANK(テーブル63[[#This Row],[管]])),VLOOKUP(テーブル63[[#This Row],[管]],管[],2,TRUE), IF(NOT(ISBLANK(テーブル63[[#This Row],[許可区分（管）]])),\"D\",\"-\"))","v":"B"},{"$f":"IF(NOT(ISBLANK(テーブル63[[#This Row],[ほ装]])),VLOOKUP(テーブル63[[#This Row],[ほ装]],ほ装[],2,TRUE), IF(NOT(ISBLANK(テーブル63[[#This Row],[許可区分(ほ装)]])),\"D\",\"-\"))","v":"-"},{"$f":"IF(NOT(ISBLANK(テーブル63[[#This Row],[塗装]])),VLOOKUP(テーブル63[[#This Row],[塗装]],塗装[],2,TRUE), IF(NOT(ISBLANK(テーブル63[[#This Row],[許可区分（塗装）]])),\"D\",\"-\"))","v":"-"},{"$f":"IF(NOT(ISBLANK(テーブル63[[#This Row],[防水]])),VLOOKUP(テーブル63[[#This Row],[防水]],塗装[],2,TRUE), IF(NOT(ISBLANK(テーブル63[[#This Row],[許可区分（防水）]])),\"D\",\"-\"))","v":"-"},{"$f":"IF(NOT(ISBLANK(テーブル63[[#This Row],[機械器具設置]])),VLOOKUP(テーブル63[[#This Row],[機械器具設置]],塗装[],2,TRUE), IF(NOT(ISBLANK(テーブル63[[#This Row],[許可区分（機械器具）]])),\"D\",\"-\"))","v":"-"},{"$f":"IF(NOT(ISBLANK(テーブル63[[#This Row],[電気通信]])),VLOOKUP(テーブル63[[#This Row],[電気通信]],電気[],2,TRUE), IF(NOT(ISBLANK(テーブル63[[#This Row],[許可区分(電気)]])),\"D\",\"-\"))","v":"-"},{"$f":"IF(NOT(ISBLANK(テーブル63[[#This Row],[水道施設]])),VLOOKUP(テーブル63[[#This Row],[水道施設]],水道[],2,TRUE), IF(NOT(ISBLANK(テーブル63[[#This Row],[許可区分（水道施設）]])),\"D\",\"-\"))","v":"-"}]
[27,"県内","㈱石川商会住宅機材","旭市ニ1710","小関　秀央","0479-62-1341","0479-63-8243","一般",648,"一般",790,"一般",643,"特定",910,null,null,null,null,null,null,null,null,null,null,null,null,{"$f":"IF(NOT(ISBLANK(テーブル63[[#This Row],[土木一式]])),VLOOKUP(テーブル63[[#This Row],[土木一式]],土木[],2,TRUE), IF(NOT(ISBLANK(テーブル63[[#This Row],[許可区分(土木)]])),\"D\",\"-\"))","v":"C"},{"$f":"IF(NOT(ISBLANK(テーブル63[[#This Row],[建築一式]])),VLOOKUP(テーブル63[[#This Row],[建築一式]],建築[],2,TRUE), IF(NOT(ISBLANK(テーブル63[[#This Row],[許可区分（建築）]])),\"D\",\"-\"))","v":"B"},{"$f":"IF(NOT(ISBLANK(テーブル63[[#This Row],[電気]])),VLOOKUP(テーブル63[[#This Row],[電気]],電気[],2,TRUE), IF(NOT(ISBLANK(テーブル63[[#This Row],[許可区分（電気）]])),\"D\",\"-\"))","v":"C"},{"$f":"IF(NOT(ISBLANK(テーブル63[[#This Row],[管]])),VLOOKUP(テーブル63[[#This Row],[管]],管[],2,TRUE), IF(NOT(ISBLANK(テーブル63[[#This Row],[許可区分（管）]])),\"D\",\"-\"))","v":"A"},{"$f":"IF(NOT(ISBLANK(テーブル63[[#This Row],[ほ装]])),VLOOKUP(テーブル63[[#This Row],[ほ装]],ほ装[],2,TRUE), IF(NOT(ISBLANK(テーブル63[[#This Row],[許可区分(ほ装)]])),\"D\",\"-\"))","v":"-"},{"$f":"IF(NOT(ISBLANK(テーブル63[[#This Row],[塗装]])),VLOOKUP(テーブル63[[#This Row],[塗装]],塗装[],2,TRUE), IF(NOT(ISBLANK(テーブル63[[#This Row],[許可区分（塗装）]])),\"D\",\"-\"))","v":"-"},{"$f":"IF(NOT(ISBLANK(テーブル63[[#This Row],[防水]])),VLOOKUP(テーブル63[[#This Row],[防水]],塗装[],2,TRUE), IF(NOT(ISBLANK(テーブル63[[#This Row],[許可区分（防水）]])),\"D\",\"-\"))","v":"-"},{"$f":"IF(NOT(ISBLANK(テーブル63[[#This Row],[機械器具設置]])),VLOOKUP(テーブル63[[#This Row],[機械器具設置]],塗装[],2,TRUE), IF(NOT(ISBLANK(テーブル63[[#This Row],[許可区分（機械器具）]])),\"D\",\"-\"))","v":"-"},{"$f":"IF(NOT(ISBLANK(テーブル63[[#This Row],[電気通信]])),VLOOKUP(テーブル63[[#This Row],[電気通信]],電気[],2,TRUE), IF(NOT(ISBLANK(テーブル63[[#This Row],[許可区分(電気)]])),\"D\",\"-\"))","v":"-"},{"$f":"IF(NOT(ISBLANK(テーブル63[[#This Row],[水道施設]])),VLOOKUP(テーブル63[[#This Row],[水道施設]],水道[],2,TRUE), IF(NOT(ISBLANK(テーブル63[[#This Row],[許可区分（水道施設）]])),\"D\",\"-\"))","v":"-"}]
[28,"県内","鈴木建設㈱","旭市後草2364-3","鈴木　和彦","0479-55-3221","0479-55-2312","特定",996,"特定",942,null,null,"一般",766,"特定",841,null,null,null,null,null,null,null,null,"特定",845,{"$f":"IF(NOT(ISBLANK(テーブル63[[#This Row],[土木一式]])),VLOOKUP(テーブル63[[#This Row],[土木一式]],土木[],2,TRUE), IF(NOT(ISBLANK(テーブル63[[#This Row],[許可区分(土木)]])),\"D\",\"-\"))","v":"A"},{"$f":"IF(NOT(ISBLANK(テーブル63[[#This Row],[建築一式]])),VLOOKUP(テーブル63[[#This Row],[建築一式]],建築[],2,TRUE), IF(NOT(ISBLANK(テーブル63[[#This Row],[許可区分（建築）]])),\"D\",\"-\"))","v":"A"},{"$f":"IF(NOT(ISBLANK(テーブル63[[#This Row],[電気]])),VLOOKUP(テーブル63[[#This Row],[電気]],電気[],2,TRUE), IF(NOT(ISBLANK(テーブル63[[#This Row],[許可区分（電気）]])),\"D\",\"-\"))","v":"-"},{"$f":"IF(NOT(ISBLANK(テーブル63[[#This Row],[管]])),VLOOKUP(テーブル63[[#This Row],[管]],管[],2,TRUE), IF(NOT(ISBLANK(テーブル63[[#This Row],[許可区分（管）]])),\"D\",\"-\"))","v":"A"},{"$f":"IF(NOT(ISBLANK(テーブル63[[#This Row],[ほ装]])),VLOOKUP(テーブル63[[#This Row],[ほ装]],ほ装[],2,TRUE), IF(NOT(ISBLANK(テーブル63[[#This Row],[許可区分(ほ装)]])),\"D\",\"-\"))","v":"A"},{"$f":"IF(NOT(ISBLANK(テーブル63[[#This Row],[塗装]])),VLOOKUP(テーブル63[[#This Row],[塗装]],塗装[],2,TRUE), IF(NOT(ISBLANK(テーブル63[[#This Row],[許可区分（塗装）]])),\"D\",\"-\"))","v":"-"},{"$f":"IF(NOT(ISBLANK(テーブル63[[#This Row],[防水]])),VLOOKUP(テーブル63[[#This Row],[防水]],塗装[],2,TRUE), IF(NOT(ISBLANK(テーブル63[[#This Row],[許可区分（防水）]])),\"D\",\"-\"))","v":"-"},{"$f":"IF(NOT(ISBLANK(テーブル63[[#This Row],[機械器具設置]])),VLOOKUP(テーブル63[[#This Row],[機械器具設置]],塗装[],2,TRUE), IF(NOT(ISBLANK(テーブル63[[#This Row],[許可区分（機械器具）]])),\"D\",\"-\"))","v":"-"},{"$f":"IF(NOT(ISBLANK(テーブル63[[#This Row],[電気通信]])),VLOOKUP(テーブル63[[#This Row],[電気通信]],電気[],2,TRUE), IF(NOT(ISBLANK(テーブル63[[#This Row],[許可区分(電気)]])),\"D\",\"-\"))","v":"-"},{"$f":"IF(NOT(ISBLANK(テーブル63[[#This Row],[水道施設]])),VLOOKUP(テーブル63[[#This Row],[水道施設]],水道[],2,TRUE), IF(NOT(ISBLANK(テーブル63[[#This Row],[許可区分（水道施設）]])),\"D\",\"-\"))","v":"A"}]
[29,"県内","昱㈱　千葉支店","千葉市若葉区貝塚町2034-1","古谷　成彦","043-232-2281","043-232-7271","特定",819,"一般",804,"特定",1431,"特定",1119,null,null,null,null,null,null,"特定",1231,"特定",1058,"特定",1004,{"$f":"IF(NOT(ISBLANK(テーブル63[[#This Row],[土木一式]])),VLOOKUP(テーブル63[[#This Row],[土木一式]],土木[],2,TRUE), IF(NOT(ISBLANK(テーブル63[[#This Row],[許可区分(土木)]])),\"D\",\"-\"))","v":"A"},{"$f":"IF(NOT(ISBLANK(テーブル63[[#This Row],[建築一式]])),VLOOKUP(テーブル63[[#This Row],[建築一式]],建築[],2,TRUE), IF(NOT(ISBLANK(テーブル63[[#This Row],[許可区分（建築）]])),\"D\",\"-\"))","v":"A"},{"$f":"IF(NOT(ISBLANK(テーブル63[[#This Row],[電気]])),VLOOKUP(テーブル63[[#This Row],[電気]],電気[],2,TRUE), IF(NOT(ISBLANK(テーブル63[[#This Row],[許可区分（電気）]])),\"D\",\"-\"))","v":"A"},{"$f":"IF(NOT(ISBLANK(テーブル63[[#This Row],[管]])),VLOOKUP(テーブル63[[#This Row],[管]],管[],2,TRUE), IF(NOT(ISBLANK(テーブル63[[#This Row],[許可区分（管）]])),\"D\",\"-\"))","v":"A"},{"$f":"IF(NOT(ISBLANK(テーブル63[[#This Row],[ほ装]])),VLOOKUP(テーブル63[[#This Row],[ほ装]],ほ装[],2,TRUE), IF(NOT(ISBLANK(テーブル63[[#This Row],[許可区分(ほ装)]])),\"D\",\"-\"))","v":"-"},{"$f":"IF(NOT(ISBLANK(テーブル63[[#This Row],[塗装]])),VLOOKUP(テーブル63[[#This Row],[塗装]],塗装[],2,TRUE), IF(NOT(ISBLANK(テーブル63[[#This Row],[許可区分（塗装）]])),\"D\",\"-\"))","v":"-"},{"$f":"IF(NOT(ISBLANK(テーブル63[[#This Row],[防水]])),VLOOKUP(テーブル63[[#This Row],[防水]],塗装[],2,TRUE), IF(NOT(ISBLANK(テーブル63[[#This Row],[許可区分（防水）]])),\"D\",\"-\"))","v":"-"},{"$f":"IF(NOT(ISBLANK(テーブル63[[#This Row],[機械器具設置]])),VLOOKUP(テーブル63[[#This Row],[機械器具設置]],塗装[],2,TRUE), IF(NOT(ISBLANK(テーブル63[[#This Row],[許可区分（機械器具）]])),\"D\",\"-\"))","v":"A"},{"$f":"IF(NOT(ISBLANK(テーブル63[[#This Row],[電気通信]])),VLOOKUP(テーブル63[[#This Row],[電気通信]],電気[],2,TRUE), IF(NOT(ISBLANK(テーブル63[[#This Row],[許可区分(電気)]])),\"D\",\"-\"))","v":"A"},{"$f":"IF(NOT(ISBLANK(テーブル63[[#This Row],[水道施設]])),VLOOKUP(テーブル63[[#This Row],[水道施設]],水道[],2,TRUE), IF(NOT(ISBLANK(テーブル63[[#This Row],[許可区分（水道施設）]])),\"D\",\"-\"))","v":"A"}]
[30,"県内","冨田電機工業㈱","千葉市若葉区小倉町882-20","冨田　一郎","043-231-3415","043-232-3261",null,null,null,null,"特定",900,"一般",718,null,null,null,null,null,null,"一般",834,null,null,null,null,{"$f":"IF(NOT(ISBLANK(テーブル63[[#This Row],[土木一式]])),VLOOKUP(テーブル63[[#This Row],[土木一式]],土木[],2,TRUE), IF(NOT(ISBLANK(テーブル63[[#This Row],[許可区分(土木)]])),\"D\",\"-\"))","v":"-"},{"$f":"IF(NOT(ISBLANK(テーブル63[[#This Row],[建築一式]])),VLOOKUP(テーブル63[[#This Row],[建築一式]],建築[],2,TRUE), IF(NOT(ISBLANK(テーブル63[[#This Row],[許可区分（建築）]])),\"D\",\"-\"))","v":"-"},{"$f":"IF(NOT(ISBLANK(テーブル63[[#This Row],[電気]])),VLOOKUP(テーブル63[[#This Row],[電気]],電気[],2,TRUE), IF(NOT(ISBLANK(テーブル63[[#This Row],[許可区分（電気）]])),\"D\",\"-\"))","v":"A"},{"$f":"IF(NOT(ISBLANK(テーブル63[[#This Row],[管]])),VLOOKUP(テーブル63[[#This Row],[管]],管[],2,TRUE), IF(NOT(ISBLANK(テーブル63[[#This Row],[許可区分（管）]])),\"D\",\"-\"))","v":"A"},{"$f":"IF(NOT(ISBLANK(テーブル63[[#This Row],[ほ装]])),VLOOKUP(テーブル63[[#This Row],[ほ装]],ほ装[],2,TRUE), IF(NOT(ISBLANK(テーブル63[[#This Row],[許可区分(ほ装)]])),\"D\",\"-\"))","v":"-"},{"$f":"IF(NOT(ISBLANK(テーブル63[[#This Row],[塗装]])),VLOOKUP(テーブル63[[#This Row],[塗装]],塗装[],2,TRUE), IF(NOT(ISBLANK(テーブル63[[#This Row],[許可区分（塗装）]])),\"D\",\"-\"))","v":"-"},{"$f":"IF(NOT(ISBLANK(テーブル63[[#This Row],[防水]])),VLOOKUP(テーブル63[[#This Row],[防水]],塗装[],2,TRUE), IF(NOT(ISBLANK(テーブル63[[#This Row],[許可区分（防水）]])),\"D\",\"-\"))","v":"-"},{"$f":"IF(NOT(ISBLANK(テーブル63[[#This Row],[機械器具設置]])),VLOOKUP(テーブル63[[#This Row],[機械器具設置]],塗装[],2,TRUE), IF(NOT(ISBLANK(テーブル63[[#This Row],[許可区分（機械器具）]])),\"D\",\"-\"))","v":"A"},{"$f":"IF(NOT(ISBLANK(テーブル63[[#This Row],[電気通信]])),VLOOKUP(テーブル63[[#This Row],[電気通信]],電気[],2,TRUE), IF(NOT(ISBLANK(テーブル63[[#This Row],[許可区分(電気)]])),\"D\",\"-\"))","v":"-"},{"$f":"IF(NOT(ISBLANK(テーブル63[[#This Row],[水道施設]])),VLOOKUP(テーブル63[[#This Row],[水道施設]],水道[],2,TRUE), IF(NOT(ISBLANK(テーブル63[[#This Row],[許可区分（水道施設）]])),\"D\",\"-\"))","v":"-"}]
[31,"県内","東海建設㈱","山武市本須賀3718","舛辰　秀男","0475-77-8677","0475-77-8676","特定",864,null,null,null,null,"一般",607,"特定",752,null,null,null,null,null,null,null,null,"特定",603,{"$f":"IF(NOT(ISBLANK(テーブル63[[#This Row],[土木一式]])),VLOOKUP(テーブル63[[#This Row],[土木一式]],土木[],2,TRUE), IF(NOT(ISBLANK(テーブル63[[#This Row],[許可区分(土木)]])),\"D\",\"-\"))","v":"A"},{"$f":"IF(NOT(ISBLANK(テーブル63[[#This Row],[建築一式]])),VLOOKUP(テーブル63[[#This Row],[建築一式]],建築[],2,TRUE), IF(NOT(ISBLANK(テーブル63[[#This Row],[許可区分（建築）]])),\"D\",\"-\"))","v":"-"},{"$f":"IF(NOT(ISBLANK(テーブル63[[#This Row],[電気]])),VLOOKUP(テーブル63[[#This Row],[電気]],電気[],2,TRUE), IF(NOT(ISBLANK(テーブル63[[#This Row],[許可区分（電気）]])),\"D\",\"-\"))","v":"-"},{"$f":"IF(NOT(ISBLANK(テーブル63[[#This Row],[管]])),VLOOKUP(テーブル63[[#This Row],[管]],管[],2,TRUE), IF(NOT(ISBLANK(テーブル63[[#This Row],[許可区分（管）]])),\"D\",\"-\"))","v":"B"},{"$f":"IF(NOT(ISBLANK(テーブル63[[#This Row],[ほ装]])),VLOOKUP(テーブル63[[#This Row],[ほ装]],ほ装[],2,TRUE), IF(NOT(ISBLANK(テーブル63[[#This Row],[許可区分(ほ装)]])),\"D\",\"-\"))","v":"A"},{"$f":"IF(NOT(ISBLANK(テーブル63[[#This Row],[塗装]])),VLOOKUP(テーブル63[[#This Row],[塗装]],塗装[],2,TRUE), IF(NOT(ISBLANK(テーブル63[[#This Row],[許可区分（塗装）]])),\"D\",\"-\"))","v":"-"},{"$f":"IF(NOT(ISBLANK(テーブル63[[#This Row],[防水]])),VLOOKUP(テーブル63[[#This Row],[防水]],塗装[],2,TRUE), IF(NOT(ISBLANK(テーブル63[[#This Row],[許可区分（防水）]])),\"D\",\"-\"))","v":"-"},{"$f":"IF(NOT(ISBLANK(テーブル63[[#This Row],[機械器具設置]])),VLOOKUP(テーブル63[[#This Row],[機械器具設置]],塗装[],2,TRUE), IF(NOT(ISBLANK(テーブル63[[#This Row],[許可区分（機械器具）]])),\"D\",\"-\"))","v":"-"},{"$f":"IF(NOT(ISBLANK(テーブル63[[#This Row],[電気通信]])),VLOOKUP(テーブル63[[#This Row],[電気通信]],電気[],2,TRUE), IF(NOT(ISBLANK(テーブル63[[#This Row],[許可区分(電気)]])),\"D\",\"-\"))","v":"-"},{"$f":"IF(NOT(ISBLANK(テーブル63[[#This Row],[水道施設]])),VLOOKUP(テーブル63[[#This Row],[水道施設]],水道[],2,TRUE), IF(NOT(ISBLANK(テーブル63[[#This Row],[許可区分（水道施設）]])),\"D\",\"-\"))","v":"C"}]
[32,"県内","東芝プラントシステム㈱　東関東営業出張所","千葉市美浜区中瀬2-6-1　","秋葉　晃良","043-297-8050","043-297-8051",null,null,null,null,"特定",1923,null,null,null,null,null,null,null,null,null,null,"特定",1272,null,null,{"$f":"IF(NOT(ISBLANK(テーブル63[[#This Row],[土木一式]])),VLOOKUP(テーブル63[[#This Row],[土木一式]],土木[],2,TRUE), IF(NOT(ISBLANK(テーブル63[[#This Row],[許可区分(土木)]])),\"D\",\"-\"))","v":"-"},{"$f":"IF(NOT(ISBLANK(テーブル63[[#This Row],[建築一式]])),VLOOKUP(テーブル63[[#This Row],[建築一式]],建築[],2,TRUE), IF(NOT(ISBLANK(テーブル63[[#This Row],[許可区分（建築）]])),\"D\",\"-\"))","v":"-"},{"$f":"IF(NOT(ISBLANK(テーブル63[[#This Row],[電気]])),VLOOKUP(テーブル63[[#This Row],[電気]],電気[],2,TRUE), IF(NOT(ISBLANK(テーブル63[[#This Row],[許可区分（電気）]])),\"D\",\"-\"))","v":"A"},{"$f":"IF(NOT(ISBLANK(テーブル63[[#This Row],[管]])),VLOOKUP(テーブル63[[#This Row],[管]],管[],2,TRUE), IF(NOT(ISBLANK(テーブル63[[#This Row],[許可区分（管）]])),\"D\",\"-\"))","v":"-"},{"$f":"IF(NOT(ISBLANK(テーブル63[[#This Row],[ほ装]])),VLOOKUP(テーブル63[[#This Row],[ほ装]],ほ装[],2,TRUE), IF(NOT(ISBLANK(テーブル63[[#This Row],[許可区分(ほ装)]])),\"D\",\"-\"))","v":"-"},{"$f":"IF(NOT(ISBLANK(テーブル63[[#This Row],[塗装]])),VLOOKUP(テーブル63[[#This Row],[塗装]],塗装[],2,TRUE), IF(NOT(ISBLANK(テーブル63[[#This Row],[許可区分（塗装）]])),\"D\",\"-\"))","v":"-"},{"$f":"IF(NOT(ISBLANK(テーブル63[[#This Row],[防水]])),VLOOKUP(テーブル63[[#This Row],[防水]],塗装[],2,TRUE), IF(NOT(ISBLANK(テーブル63[[#This Row],[許可区分（防水）]])),\"D\",\"-\"))","v":"-"},{"$f":"IF(NOT(ISBLANK(テーブル63[[#This Row],[機械器具設置]])),VLOOKUP(テーブル63[[#This Row],[機械器具設置]],塗装[],2,TRUE), IF(NOT(ISBLANK(テーブル63[[#This Row],[許可区分（機械器具）]])),\"D\",\"-\"))","v":"-"},{"$f":"IF(NOT(ISBLANK(テーブル63[[#This Row],[電気通信]])),VLOOKUP(テーブル63[[#This Row],[電気通信]],電気[],2,TRUE), IF(NOT(ISBLANK(テーブル63[[#This Row],[許可区分(電気)]])),\"D\",\"-\"))","v":"A"},{"$f":"IF(NOT(ISBLANK(テーブル63[[#This Row],[水道施設]])),VLOOKUP(テーブル63[[#This Row],[水道施設]],水道[],2,TRUE), IF(NOT(ISBLANK(テーブル63[[#This Row],[許可区分（水道施設）]])),\"D\",\"-\"))","v":"-"}]
[33,"県内","石井工業㈱","香取市北2-6-3","石井　良典","0478-55-1511","0478-55-1460","特定",1054,"特定",1118,null,null,null,null,"特定",829,null,null,null,null,null,null,null,null,"特定",730,{"$f":"IF(NOT(ISBLANK(テーブル63[[#This Row],[土木一式]])),VLOOKUP(テーブル63[[#This Row],[土木一式]],土木[],2,TRUE), IF(NOT(ISBLANK(テーブル63[[#This Row],[許可区分(土木)]])),\"D\",\"-\"))","v":"A"},{"$f":"IF(NOT(ISBLANK(テーブル63[[#This Row],[建築一式]])),VLOOKUP(テーブル63[[#This Row],[建築一式]],建築[],2,TRUE), IF(NOT(ISBLANK(テーブル63[[#This Row],[許可区分（建築）]])),\"D\",\"-\"))","v":"A"},{"$f":"IF(NOT(ISBLANK(テーブル63[[#This Row],[電気]])),VLOOKUP(テーブル63[[#This Row],[電気]],電気[],2,TRUE), IF(NOT(ISBLANK(テーブル63[[#This Row],[許可区分（電気）]])),\"D\",\"-\"))","v":"-"},{"$f":"IF(NOT(ISBLANK(テーブル63[[#This Row],[管]])),VLOOKUP(テーブル63[[#This Row],[管]],管[],2,TRUE), IF(NOT(ISBLANK(テーブル63[[#This Row],[許可区分（管）]])),\"D\",\"-\"))","v":"-"},{"$f":"IF(NOT(ISBLANK(テーブル63[[#This Row],[ほ装]])),VLOOKUP(テーブル63[[#This Row],[ほ装]],ほ装[],2,TRUE), IF(NOT(ISBLANK(テーブル63[[#This Row],[許可区分(ほ装)]])),\"D\",\"-\"))","v":"A"},{"$f":"IF(NOT(ISBLANK(テーブル63[[#This Row],[塗装]])),VLOOKUP(テーブル63[[#This Row],[塗装]],塗装[],2,TRUE), IF(NOT(ISBLANK(テーブル63[[#This Row],[許可区分（塗装）]])),\"D\",\"-\"))","v":"-"},{"$f":"IF(NOT(ISBLANK(テーブル63[[#This Row],[防水]])),VLOOKUP(テーブル63[[#This Row],[防水]],塗装[],2,TRUE), IF(NOT(ISBLANK(テーブル63[[#This Row],[許可区分（防水）]])),\"D\",\"-\"))","v":"-"},{"$f":"IF(NOT(ISBLANK(テーブル63[[#This Row],[機械器具設置]])),VLOOKUP(テーブル63[[#This Row],[機械器具設置]],塗装[],2,TRUE), IF(NOT(ISBLANK(テーブル63[[#This Row],[許可区分（機械器具）]])),\"D\",\"-\"))","v":"-"},{"$f":"IF(NOT(ISBLANK(テーブル63[[#This Row],[電気通信]])),VLOOKUP(テーブル63[[#This Row],[電気通信]],電気[],2,TRUE), IF(NOT(ISBLANK(テーブル63[[#This Row],[許可区分(電気)]])),\"D\",\"-\"))","v":"-"},{"$f":"IF(NOT(ISBLANK(テーブル63[[#This Row],[水道施設]])),VLOOKUP(テーブル63[[#This Row],[水道施設]],水道[],2,TRUE), IF(NOT(ISBLANK(テーブル63[[#This Row],[許可区分（水道施設）]])),\"D\",\"-\"))","v":"B"}]
[34,"県内","㈱三和電設","市原市若宮1-11-11","南山　和也","0436-43-3555","0439-55-5116",null,null,null,null,"特定",952,"一般",741,null,null,null,null,null,null,null,null,null,null,null,null,{"$f":"IF(NOT(ISBLANK(テーブル63[[#This Row],[土木一式]])),VLOOKUP(テーブル63[[#This Row],[土木一式]],土木[],2,TRUE), IF(NOT(ISBLANK(テーブル63[[#This Row],[許可区分(土木)]])),\"D\",\"-\"))","v":"-"},{"$f":"IF(NOT(ISBLANK(テーブル63[[#This Row],[建築一式]])),VLOOKUP(テーブル63[[#This Row],[建築一式]],建築[],2,TRUE), IF(NOT(ISBLANK(テーブル63[[#This Row],[許可区分（建築）]])),\"D\",\"-\"))","v":"-"},{"$f":"IF(NOT(ISBLANK(テーブル63[[#This Row],[電気]])),VLOOKUP(テーブル63[[#This Row],[電気]],電気[],2,TRUE), IF(NOT(ISBLANK(テーブル63[[#This Row],[許可区分（電気）]])),\"D\",\"-\"))","v":"A"},{"$f":"IF(NOT(ISBLANK(テーブル63[[#This Row],[管]])),VLOOKUP(テーブル63[[#This Row],[管]],管[],2,TRUE), IF(NOT(ISBLANK(テーブル63[[#This Row],[許可区分（管）]])),\"D\",\"-\"))","v":"A"},{"$f":"IF(NOT(ISBLANK(テーブル63[[#This Row],[ほ装]])),VLOOKUP(テーブル63[[#This Row],[ほ装]],ほ装[],2,TRUE), IF(NOT(ISBLANK(テーブル63[[#This Row],[許可区分(ほ装)]])),\"D\",\"-\"))","v":"-"},{"$f":"IF(NOT(ISBLANK(テーブル63[[#This Row],[塗装]])),VLOOKUP(テーブル63[[#This Row],[塗装]],塗装[],2,TRUE), IF(NOT(ISBLANK(テーブル63[[#This Row],[許可区分（塗装）]])),\"D\",\"-\"))","v":"-"},{"$f":"IF(NOT(ISBLANK(テーブル63[[#This Row],[防水]])),VLOOKUP(テーブル63[[#This Row],[防水]],塗装[],2,TRUE), IF(NOT(ISBLANK(テーブル63[[#This Row],[許可区分（防水）]])),\"D\",\"-\"))","v":"-"},{"$f":"IF(NOT(ISBLANK(テーブル63[[#This Row],[機械器具設置]])),VLOOKUP(テーブル63[[#This Row],[機械器具設置]],塗装[],2,TRUE), IF(NOT(ISBLANK(テーブル63[[#This Row],[許可区分（機械器具）]])),\"D\",\"-\"))","v":"-"},{"$f":"IF(NOT(ISBLANK(テーブル63[[#This Row],[電気通信]])),VLOOKUP(テーブル63[[#This Row],[電気通信]],電気[],2,TRUE), IF(NOT(ISBLANK(テーブル63[[#This Row],[許可区分(電気)]])),\"D\",\"-\"))","v":"-"},{"$f":"IF(NOT(ISBLANK(テーブル63[[#This Row],[水道施設]])),VLOOKUP(テーブル63[[#This Row],[水道施設]],水道[],2,TRUE), IF(NOT(ISBLANK(テーブル63[[#This Row],[許可区分（水道施設）]])),\"D\",\"-\"))","v":"-"}]
[35,"県内","㈱カイホ","山武郡横芝光町北清水267","永野　貞雄","0479-82-4571","0479-82-4194",null,null,null,null,null,null,null,null,null,null,"一般",834,"一般",759,null,null,null,null,null,null,{"$f":"IF(NOT(ISBLANK(テーブル63[[#This Row],[土木一式]])),VLOOKUP(テーブル63[[#This Row],[土木一式]],土木[],2,TRUE), IF(NOT(ISBLANK(テーブル63[[#This Row],[許可区分(土木)]])),\"D\",\"-\"))","v":"-"},{"$f":"IF(NOT(ISBLANK(テーブル63[[#This Row],[建築一式]])),VLOOKUP(テーブル63[[#This Row],[建築一式]],建築[],2,TRUE), IF(NOT(ISBLANK(テーブル63[[#This Row],[許可区分（建築）]])),\"D\",\"-\"))","v":"-"},{"$f":"IF(NOT(ISBLANK(テーブル63[[#This Row],[電気]])),VLOOKUP(テーブル63[[#This Row],[電気]],電気[],2,TRUE), IF(NOT(ISBLANK(テーブル63[[#This Row],[許可区分（電気）]])),\"D\",\"-\"))","v":"-"},{"$f":"IF(NOT(ISBLANK(テーブル63[[#This Row],[管]])),VLOOKUP(テーブル63[[#This Row],[管]],管[],2,TRUE), IF(NOT(ISBLANK(テーブル63[[#This Row],[許可区分（管）]])),\"D\",\"-\"))","v":"-"},{"$f":"IF(NOT(ISBLANK(テーブル63[[#This Row],[ほ装]])),VLOOKUP(テーブル63[[#This Row],[ほ装]],ほ装[],2,TRUE), IF(NOT(ISBLANK(テーブル63[[#This Row],[許可区分(ほ装)]])),\"D\",\"-\"))","v":"-"},{"$f":"IF(NOT(ISBLANK(テーブル63[[#This Row],[塗装]])),VLOOKUP(テーブル63[[#This Row],[塗装]],塗装[],2,TRUE), IF(NOT(ISBLANK(テーブル63[[#This Row],[許可区分（塗装）]])),\"D\",\"-\"))","v":"A"},{"$f":"IF(NOT(ISBLANK(テーブル63[[#This Row],[防水]])),VLOOKUP(テーブル63[[#This Row],[防水]],塗装[],2,TRUE), IF(NOT(ISBLANK(テーブル63[[#This Row],[許可区分（防水）]])),\"D\",\"-\"))","v":"B"},{"$f":"IF(NOT(ISBLANK(テーブル63[[#This Row],[機械器具設置]])),VLOOKUP(テーブル63[[#This Row],[機械器具設置]],塗装[],2,TRUE), IF(NOT(ISBLANK(テーブル63[[#This Row],[許可区分（機械器具）]])),\"D\",\"-\"))","v":"-"},{"$f":"IF(NOT(ISBLANK(テーブル63[[#This Row],[電気通信]])),VLOOKUP(テーブル63[[#This Row],[電気通信]],電気[],2,TRUE), IF(NOT(ISBLANK(テーブル63[[#This Row],[許可区分(電気)]])),\"D\",\"-\"))","v":"-"},{"$f":"IF(NOT(ISBLANK(テーブル63[[#This Row],[水道施設]])),VLOOKUP(テーブル63[[#This Row],[水道施設]],水道[],2,TRUE), IF(NOT(ISBLANK(テーブル63[[#This Row],[許可区分（水道施設）]])),\"D\",\"-\"))","v":"-"}]
[36,"県内","㈱総和","山武郡九十九里町片貝3553","丸山　善之","0475-76-7371","0475-76-7372","一般",587,"一般",663,null,null,null,null,null,null,"一般",735,"一般",644,null,null,null,null,null,null,{"$f":"IF(NOT(ISBLANK(テーブル63[[#This Row],[土木一式]])),VLOOKUP(テーブル63[[#This Row],[土木一式]],土木[],2,TRUE), IF(NOT(ISBLANK(テーブル63[[#This Row],[許可区分(土木)]])),\"D\",\"-\"))","v":"C"},{"$f":"IF(NOT(ISBLANK(テーブル63[[#This Row],[建築一式]])),VLOOKUP(テーブル63[[#This Row],[建築一式]],建築[],2,TRUE), IF(NOT(ISBLANK(テーブル63[[#This Row],[許可区分（建築）]])),\"D\",\"-\"))","v":"C"},{"$f":"IF(NOT(ISBLANK(テーブル63[[#This Row],[電気]])),VLOOKUP(テーブル63[[#This Row],[電気]],電気[],2,TRUE), IF(NOT(ISBLANK(テーブル63[[#This Row],[許可区分（電気）]])),\"D\",\"-\"))","v":"-"},{"$f":"IF(NOT(ISBLANK(テーブル63[[#This Row],[管]])),VLOOKUP(テーブル63[[#This Row],[管]],管[],2,TRUE), IF(NOT(ISBLANK(テーブル63[[#This Row],[許可区分（管）]])),\"D\",\"-\"))","v":"-"},{"$f":"IF(NOT(ISBLANK(テーブル63[[#This Row],[ほ装]])),VLOOKUP(テーブル63[[#This Row],[ほ装]],ほ装[],2,TRUE), IF(NOT(ISBLANK(テーブル63[[#This Row],[許可区分(ほ装)]])),\"D\",\"-\"))","v":"-"},{"$f":"IF(NOT(ISBLANK(テーブル63[[#This Row],[塗装]])),VLOOKUP(テーブル63[[#This Row],[塗装]],塗装[],2,TRUE), IF(NOT(ISBLANK(テーブル63[[#This Row],[許可区分（塗装）]])),\"D\",\"-\"))","v":"B"},{"$f":"IF(NOT(ISBLANK(テーブル63[[#This Row],[防水]])),VLOOKUP(テーブル63[[#This Row],[防水]],塗装[],2,TRUE), IF(NOT(ISBLANK(テーブル63[[#This Row],[許可区分（防水）]])),\"D\",\"-\"))","v":"C"},{"$f":"IF(NOT(ISBLANK(テーブル63[[#This Row],[機械器具設置]])),VLOOKUP(テーブル63[[#This Row],[機械器具設置]],塗装[],2,TRUE), IF(NOT(ISBLANK(テーブル63[[#This Row],[許可区分（機械器具）]])),\"D\",\"-\"))","v":"-"},{"$f":"IF(NOT(ISBLANK(テーブル63[[#This Row],[電気通信]])),VLOOKUP(テーブル63[[#This Row],[電気通信]],電気[],2,TRUE), IF(NOT(ISBLANK(テーブル63[[#This Row],[許可区分(電気)]])),\"D\",\"-\"))","v":"-"},{"$f":"IF(NOT(ISBLANK(テーブル63[[#This Row],[水道施設]])),VLOOKUP(テーブル63[[#This Row],[水道施設]],水道[],2,TRUE), IF(NOT(ISBLANK(テーブル63[[#This Row],[許可区分（水道施設）]])),\"D\",\"-\"))","v":"-"}]
[37,"県内","村本建設㈱　千葉支店","千葉市中央区新町17-16","今枝　利夫","043-242-2161","043-244-2165","特定",1537,"特定",1672,null,null,null,null,"特定",1071,null,null,null,null,null,null,null,null,"特定",1245,{"$f":"IF(NOT(ISBLANK(テーブル63[[#This Row],[土木一式]])),VLOOKUP(テーブル63[[#This Row],[土木一式]],土木[],2,TRUE), IF(NOT(ISBLANK(テーブル63[[#This Row],[許可区分(土木)]])),\"D\",\"-\"))","v":"A"},{"$f":"IF(NOT(ISBLANK(テーブル63[[#This Row],[建築一式]])),VLOOKUP(テーブル63[[#This Row],[建築一式]],建築[],2,TRUE), IF(NOT(ISBLANK(テーブル63[[#This Row],[許可区分（建築）]])),\"D\",\"-\"))","v":"A"},{"$f":"IF(NOT(ISBLANK(テーブル63[[#This Row],[電気]])),VLOOKUP(テーブル63[[#This Row],[電気]],電気[],2,TRUE), IF(NOT(ISBLANK(テーブル63[[#This Row],[許可区分（電気）]])),\"D\",\"-\"))","v":"-"},{"$f":"IF(NOT(ISBLANK(テーブル63[[#This Row],[管]])),VLOOKUP(テーブル63[[#This Row],[管]],管[],2,TRUE), IF(NOT(ISBLANK(テーブル63[[#This Row],[許可区分（管）]])),\"D\",\"-\"))","v":"-"},{"$f":"IF(NOT(ISBLANK(テーブル63[[#This Row],[ほ装]])),VLOOKUP(テーブル63[[#This Row],[ほ装]],ほ装[],2,TRUE), IF(NOT(ISBLANK(テーブル63[[#This Row],[許可区分(ほ装)]])),\"D\",\"-\"))","v":"A"},{"$f":"IF(NOT(ISBLANK(テーブル63[[#This Row],[塗装]])),VLOOKUP(テーブル63[[#This Row],[塗装]],塗装[],2,TRUE), IF(NOT(ISBLANK(テーブル63[[#This Row],[許可区分（塗装）]])),\"D\",\"-\"))","v":"-"},{"$f":"IF(NOT(ISBLANK(テーブル63[[#This Row],[防水]])),VLOOKUP(テーブル63[[#This Row],[防水]],塗装[],2,TRUE), IF(NOT(ISBLANK(テーブル63[[#This Row],[許可区分（防水）]])),\"D\",\"-\"))","v":"-"},{"$f":"IF(NOT(ISBLANK(テーブル63[[#This Row],[機械器具設置]])),VLOOKUP(テーブル63[[#This Row],[機械器具設置]],塗装[],2,TRUE), IF(NOT(ISBLANK(テーブル63[[#This Row],[許可区分（機械器具）]])),\"D\",\"-\"))","v":"-"},{"$f":"IF(NOT(ISBLANK(テーブル63[[#This Row],[電気通信]])),VLOOKUP(テーブル63[[#This Row],[電気通信]],電気[],2,TRUE), IF(NOT(ISBLANK(テーブル63[[#This Row],[許可区分(電気)]])),\"D\",\"-\"))","v":"-"},{"$f":"IF(NOT(ISBLANK(テーブル63[[#This Row],[水道施設]])),VLOOKUP(テーブル63[[#This Row],[水道施設]],水道[],2,TRUE), IF(NOT(ISBLANK(テーブル63[[#This Row],[許可区分（水道施設）]])),\"D\",\"-\"))","v":"A"}]
[38,"県内","㈱橋本電業社","千葉市花見川区作新台4-16-10","橋本　淳","043-259-8415","043-259-8413",null,null,null,null,"特定",1051,null,null,null,null,null,null,null,null,null,null,"一般",753,null,null,{"$f":"IF(NOT(ISBLANK(テーブル63[[#This Row],[土木一式]])),VLOOKUP(テーブル63[[#This Row],[土木一式]],土木[],2,TRUE), IF(NOT(ISBLANK(テーブル63[[#This Row],[許可区分(土木)]])),\"D\",\"-\"))","v":"-"},{"$f":"IF(NOT(ISBLANK(テーブル63[[#This Row],[建築一式]])),VLOOKUP(テーブル63[[#This Row],[建築一式]],建築[],2,TRUE), IF(NOT(ISBLANK(テーブル63[[#This Row],[許可区分（建築）]])),\"D\",\"-\"))","v":"-"},{"$f":"IF(NOT(ISBLANK(テーブル63[[#This Row],[電気]])),VLOOKUP(テーブル63[[#This Row],[電気]],電気[],2,TRUE), IF(NOT(ISBLANK(テーブル63[[#This Row],[許可区分（電気）]])),\"D\",\"-\"))","v":"A"},{"$f":"IF(NOT(ISBLANK(テーブル63[[#This Row],[管]])),VLOOKUP(テーブル63[[#This Row],[管]],管[],2,TRUE), IF(NOT(ISBLANK(テーブル63[[#This Row],[許可区分（管）]])),\"D\",\"-\"))","v":"-"},{"$f":"IF(NOT(ISBLANK(テーブル63[[#This Row],[ほ装]])),VLOOKUP(テーブル63[[#This Row],[ほ装]],ほ装[],2,TRUE), IF(NOT(ISBLANK(テーブル63[[#This Row],[許可区分(ほ装)]])),\"D\",\"-\"))","v":"-"},{"$f":"IF(NOT(ISBLANK(テーブル63[[#This Row],[塗装]])),VLOOKUP(テーブル63[[#This Row],[塗装]],塗装[],2,TRUE), IF(NOT(ISBLANK(テーブル63[[#This Row],[許可区分（塗装）]])),\"D\",\"-\"))","v":"-"},{"$f":"IF(NOT(ISBLANK(テーブル63[[#This Row],[防水]])),VLOOKUP(テーブル63[[#This Row],[防水]],塗装[],2,TRUE), IF(NOT(ISBLANK(テーブル63[[#This Row],[許可区分（防水）]])),\"D\",\"-\"))","v":"-"},{"$f":"IF(NOT(ISBLANK(テーブル63[[#This Row],[機械器具設置]])),VLOOKUP(テーブル63[[#This Row],[機械器具設置]],塗装[],2,TRUE), IF(NOT(ISBLANK(テーブル63[[#This Row],[許可区分（機械器具）]])),\"D\",\"-\"))","v":"-"},{"$f":"IF(NOT(ISBLANK(テーブル63[[#This Row],[電気通信]])),VLOOKUP(テーブル63[[#This Row],[電気通信]],電気[],2,TRUE), IF(NOT(ISBLANK(テーブル63[[#This Row],[許可区分(電気)]])),\"D\",\"-\"))","v":"B"},{"$f":"IF(NOT(ISBLANK(テーブル63[[#This Row],[水道施設]])),VLOOKUP(テーブル63[[#This Row],[水道施設]],水道[],2,TRUE), IF(NOT(ISBLANK(テーブル63[[#This Row],[許可区分（水道施設）]])),\"D\",\"-\"))","v":"-"}]
[39,"県内","大日本土木㈱　千葉支店","千葉市中央区新千葉2-5-14","佐藤　孝正","043-246-1911","043-248-4467","特定",1661,"特定",1650,null,null,null,null,"特定",1124,null,null,null,null,null,null,null,null,"特定",1379,{"$f":"IF(NOT(ISBLANK(テーブル63[[#This Row],[土木一式]])),VLOOKUP(テーブル63[[#This Row],[土木一式]],土木[],2,TRUE), IF(NOT(ISBLANK(テーブル63[[#This Row],[許可区分(土木)]])),\"D\",\"-\"))","v":"A"},{"$f":"IF(NOT(ISBLANK(テーブル63[[#This Row],[建築一式]])),VLOOKUP(テーブル63[[#This Row],[建築一式]],建築[],2,TRUE), IF(NOT(ISBLANK(テーブル63[[#This Row],[許可区分（建築）]])),\"D\",\"-\"))","v":"A"},{"$f":"IF(NOT(ISBLANK(テーブル63[[#This Row],[電気]])),VLOOKUP(テーブル63[[#This Row],[電気]],電気[],2,TRUE), IF(NOT(ISBLANK(テーブル63[[#This Row],[許可区分（電気）]])),\"D\",\"-\"))","v":"-"},{"$f":"IF(NOT(ISBLANK(テーブル63[[#This Row],[管]])),VLOOKUP(テーブル63[[#This Row],[管]],管[],2,TRUE), IF(NOT(ISBLANK(テーブル63[[#This Row],[許可区分（管）]])),\"D\",\"-\"))","v":"-"},{"$f":"IF(NOT(ISBLANK(テーブル63[[#This Row],[ほ装]])),VLOOKUP(テーブル63[[#This Row],[ほ装]],ほ装[],2,TRUE), IF(NOT(ISBLANK(テーブル63[[#This Row],[許可区分(ほ装)]])),\"D\",\"-\"))","v":"A"},{"$f":"IF(NOT(ISBLANK(テーブル63[[#This Row],[塗装]])),VLOOKUP(テーブル63[[#This Row],[塗装]],塗装[],2,TRUE), IF(NOT(ISBLANK(テーブル63[[#This Row],[許可区分（塗装）]])),\"D\",\"-\"))","v":"-"},{"$f":"IF(NOT(ISBLANK(テーブル63[[#This Row],[防水]])),VLOOKUP(テーブル63[[#This Row],[防水]],塗装[],2,TRUE), IF(NOT(ISBLANK(テーブル63[[#This Row],[許可区分（防水）]])),\"D\",\"-\"))","v":"-"},{"$f":"IF(NOT(ISBLANK(テーブル63[[#This Row],[機械器具設置]])),VLOOKUP(テーブル63[[#This Row],[機械器具設置]],塗装[],2,TRUE), IF(NOT(ISBLANK(テーブル63[[#This Row],[許可区分（機械器具）]])),\"D\",\"-\"))","v":"-"},{"$f":"IF(NOT(ISBLANK(テーブル63[[#This Row],[電気通信]])),VLOOKUP(テーブル63[[#This Row],[電気通信]],電気[],2,TRUE), IF(NOT(ISBLANK(テーブル63[[#This Row],[許可区分(電気)]])),\"D\",\"-\"))","v":"-"},{"$f":"IF(NOT(ISBLANK(テーブル63[[#This Row],[水道施設]])),VLOOKUP(テーブル63[[#This Row],[水道施設]],水道[],2,TRUE), IF(NOT(ISBLANK(テーブル63[[#This Row],[許可区分（水道施設）]])),\"D\",\"-\"))","v":"A"}]
[40,"県内","㈱森山塗工","松戸市南花島3-51-8","森山　直幸","047-362-0656","047-361-2602",null,null,"特定",588,null,null,null,null,null,null,"特定",813,"特定",693,null,null,null,null,null,null,{"$f":"IF(NOT(ISBLANK(テーブル63[[#This Row],[土木一式]])),VLOOKUP(テーブル63[[#This Row],[土木一式]],土木[],2,TRUE), IF(NOT(ISBLANK(テーブル63[[#This Row],[許可区分(土木)]])),\"D\",\"-\"))","v":"-"},{"$f":"IF(NOT(ISBLANK(テーブル63[[#This Row],[建築一式]])),VLOOKUP(テーブル63[[#This Row],[建築一式]],建築[],2,TRUE), IF(NOT(ISBLANK(テーブル63[[#This Row],[許可区分（建築）]])),\"D\",\"-\"))","v":"D"},{"$f":"IF(NOT(ISBLANK(テーブル63[[#This Row],[電気]])),VLOOKUP(テーブル63[[#This Row],[電気]],電気[],2,TRUE), IF(NOT(ISBLANK(テーブル63[[#This Row],[許可区分（電気）]])),\"D\",\"-\"))","v":"-"},{"$f":"IF(NOT(ISBLANK(テーブル63[[#This Row],[管]])),VLOOKUP(テーブル63[[#This Row],[管]],管[],2,TRUE), IF(NOT(ISBLANK(テーブル63[[#This Row],[許可区分（管）]])),\"D\",\"-\"))","v":"-"},{"$f":"IF(NOT(ISBLANK(テーブル63[[#This Row],[ほ装]])),VLOOKUP(テーブル63[[#This Row],[ほ装]],ほ装[],2,TRUE), IF(NOT(ISBLANK(テーブル63[[#This Row],[許可区分(ほ装)]])),\"D\",\"-\"))","v":"-"},{"$f":"IF(NOT(ISBLANK(テーブル63[[#This Row],[塗装]])),VLOOKUP(テーブル63[[#This Row],[塗装]],塗装[],2,TRUE), IF(NOT(ISBLANK(テーブル63[[#This Row],[許可区分（塗装）]])),\"D\",\"-\"))","v":"A"},{"$f":"IF(NOT(ISBLANK(テーブル63[[#This Row],[防水]])),VLOOKUP(テーブル63[[#This Row],[防水]],塗装[],2,TRUE), IF(NOT(ISBLANK(テーブル63[[#This Row],[許可区分（防水）]])),\"D\",\"-\"))","v":"C"},{"$f":"IF(NOT(ISBLANK(テーブル63[[#This Row],[機械器具設置]])),VLOOKUP(テーブル63[[#This Row],[機械器具設置]],塗装[],2,TRUE), IF(NOT(ISBLANK(テーブル63[[#This Row],[許可区分（機械器具）]])),\"D\",\"-\"))","v":"-"},{"$f":"IF(NOT(ISBLANK(テーブル63[[#This Row],[電気通信]])),VLOOKUP(テーブル63[[#This Row],[電気通信]],電気[],2,TRUE), IF(NOT(ISBLANK(テーブル63[[#This Row],[許可区分(電気)]])),\"D\",\"-\"))","v":"-"},{"$f":"IF(NOT(ISBLANK(テーブル63[[#This Row],[水道施設]])),VLOOKUP(テーブル63[[#This Row],[水道施設]],水道[],2,TRUE), IF(NOT(ISBLANK(テーブル63[[#This Row],[許可区分（水道施設）]])),\"D\",\"-\"))","v":"-"}]
[41,"県内","㈱オーヤラックス　千葉営業所","千葉市中央区松ヶ丘町19-3","星野　竜也","043-266-6151","043-266-6154",null,null,null,null,null,null,null,null,null,null,null,null,null,null,"一般",908,null,null,null,null,{"$f":"IF(NOT(ISBLANK(テーブル63[[#This Row],[土木一式]])),VLOOKUP(テーブル63[[#This Row],[土木一式]],土木[],2,TRUE), IF(NOT(ISBLANK(テーブル63[[#This Row],[許可区分(土木)]])),\"D\",\"-\"))","v":"-"},{"$f":"IF(NOT(ISBLANK(テーブル63[[#This Row],[建築一式]])),VLOOKUP(テーブル63[[#This Row],[建築一式]],建築[],2,TRUE), IF(NOT(ISBLANK(テーブル63[[#This Row],[許可区分（建築）]])),\"D\",\"-\"))","v":"-"},{"$f":"IF(NOT(ISBLANK(テーブル63[[#This Row],[電気]])),VLOOKUP(テーブル63[[#This Row],[電気]],電気[],2,TRUE), IF(NOT(ISBLANK(テーブル63[[#This Row],[許可区分（電気）]])),\"D\",\"-\"))","v":"-"},{"$f":"IF(NOT(ISBLANK(テーブル63[[#This Row],[管]])),VLOOKUP(テーブル63[[#This Row],[管]],管[],2,TRUE), IF(NOT(ISBLANK(テーブル63[[#This Row],[許可区分（管）]])),\"D\",\"-\"))","v":"-"},{"$f":"IF(NOT(ISBLANK(テーブル63[[#This Row],[ほ装]])),VLOOKUP(テーブル63[[#This Row],[ほ装]],ほ装[],2,TRUE), IF(NOT(ISBLANK(テーブル63[[#This Row],[許可区分(ほ装)]])),\"D\",\"-\"))","v":"-"},{"$f":"IF(NOT(ISBLANK(テーブル63[[#This Row],[塗装]])),VLOOKUP(テーブル63[[#This Row],[塗装]],塗装[],2,TRUE), IF(NOT(ISBLANK(テーブル63[[#This Row],[許可区分（塗装）]])),\"D\",\"-\"))","v":"-"},{"$f":"IF(NOT(ISBLANK(テーブル63[[#This Row],[防水]])),VLOOKUP(テーブル63[[#This Row],[防水]],塗装[],2,TRUE), IF(NOT(ISBLANK(テーブル63[[#This Row],[許可区分（防水）]])),\"D\",\"-\"))","v":"-"},{"$f":"IF(NOT(ISBLANK(テーブル63[[#This Row],[機械器具設置]])),VLOOKUP(テーブル63[[#This Row],[機械器具設置]],塗装[],2,TRUE), IF(NOT(ISBLANK(テーブル63[[#This Row],[許可区分（機械器具）]])),\"D\",\"-\"))","v":"A"},{"$f":"IF(NOT(ISBLANK(テーブル63[[#This Row],[電気通信]])),VLOOKUP(テーブル63[[#This Row],[電気通信]],電気[],2,TRUE), IF(NOT(ISBLANK(テーブル63[[#This Row],[許可区分(電気)]])),\"D\",\"-\"))","v":"-"},{"$f":"IF(NOT(ISBLANK(テーブル63[[#This Row],[水道施設]])),VLOOKUP(テーブル63[[#This Row],[水道施設]],水道[],2,TRUE), IF(NOT(ISBLANK(テーブル63[[#This Row],[許可区分（水道施設）]])),\"D\",\"-\"))","v":"-"}]
[42,"県内","荏原実業㈱　東関東支社","千葉市中央区新田町5-10　わかちく千葉ビル","東　享延","043-241-8311","043-243-9178","特定",1060,null,null,"特定",1308,"特定",1238,null,null,"特定",920,"特定",872,"特定",1345,null,null,"特定",1227,{"$f":"IF(NOT(ISBLANK(テーブル63[[#This Row],[土木一式]])),VLOOKUP(テーブル63[[#This Row],[土木一式]],土木[],2,TRUE), IF(NOT(ISBLANK(テーブル63[[#This Row],[許可区分(土木)]])),\"D\",\"-\"))","v":"A"},{"$f":"IF(NOT(ISBLANK(テーブル63[[#This Row],[建築一式]])),VLOOKUP(テーブル63[[#This Row],[建築一式]],建築[],2,TRUE), IF(NOT(ISBLANK(テーブル63[[#This Row],[許可区分（建築）]])),\"D\",\"-\"))","v":"-"},{"$f":"IF(NOT(ISBLANK(テーブル63[[#This Row],[電気]])),VLOOKUP(テーブル63[[#This Row],[電気]],電気[],2,TRUE), IF(NOT(ISBLANK(テーブル63[[#This Row],[許可区分（電気）]])),\"D\",\"-\"))","v":"A"},{"$f":"IF(NOT(ISBLANK(テーブル63[[#This Row],[管]])),VLOOKUP(テーブル63[[#This Row],[管]],管[],2,TRUE), IF(NOT(ISBLANK(テーブル63[[#This Row],[許可区分（管）]])),\"D\",\"-\"))","v":"A"},{"$f":"IF(NOT(ISBLANK(テーブル63[[#This Row],[ほ装]])),VLOOKUP(テーブル63[[#This Row],[ほ装]],ほ装[],2,TRUE), IF(NOT(ISBLANK(テーブル63[[#This Row],[許可区分(ほ装)]])),\"D\",\"-\"))","v":"-"},{"$f":"IF(NOT(ISBLANK(テーブル63[[#This Row],[塗装]])),VLOOKUP(テーブル63[[#This Row],[塗装]],塗装[],2,TRUE), IF(NOT(ISBLANK(テーブル63[[#This Row],[許可区分（塗装）]])),\"D\",\"-\"))","v":"A"},{"$f":"IF(NOT(ISBLANK(テーブル63[[#This Row],[防水]])),VLOOKUP(テーブル63[[#This Row],[防水]],塗装[],2,TRUE), IF(NOT(ISBLANK(テーブル63[[#This Row],[許可区分（防水）]])),\"D\",\"-\"))","v":"A"},{"$f":"IF(NOT(ISBLANK(テーブル63[[#This Row],[機械器具設置]])),VLOOKUP(テーブル63[[#This Row],[機械器具設置]],塗装[],2,TRUE), IF(NOT(ISBLANK(テーブル63[[#This Row],[許可区分（機械器具）]])),\"D\",\"-\"))","v":"A"},{"$f":"IF(NOT(ISBLANK(テーブル63[[#This Row],[電気通信]])),VLOOKUP(テーブル63[[#This Row],[電気通信]],電気[],2,TRUE), IF(NOT(ISBLANK(テーブル63[[#This Row],[許可区分(電気)]])),\"D\",\"-\"))","v":"-"},{"$f":"IF(NOT(ISBLANK(テーブル63[[#This Row],[水道施設]])),VLOOKUP(テーブル63[[#This Row],[水道施設]],水道[],2,TRUE), IF(NOT(ISBLANK(テーブル63[[#This Row],[許可区分（水道施設）]])),\"D\",\"-\"))","v":"A"}]
[43,"県内","戸田建設㈱　千葉支店","千葉市中央区本千葉町15番1号","林　和男","043-307-8583","043-307-8584","特定",1956,"特定",1980,"特定",1457,"特定",1513,"特定",1271,"特定",1042,"特定",1042,null,null,null,null,"特定",1498,{"$f":"IF(NOT(ISBLANK(テーブル63[[#This Row],[土木一式]])),VLOOKUP(テーブル63[[#This Row],[土木一式]],土木[],2,TRUE), IF(NOT(ISBLANK(テーブル63[[#This Row],[許可区分(土木)]])),\"D\",\"-\"))","v":"A"},{"$f":"IF(NOT(ISBLANK(テーブル63[[#This Row],[建築一式]])),VLOOKUP(テーブル63[[#This Row],[建築一式]],建築[],2,TRUE), IF(NOT(ISBLANK(テーブル63[[#This Row],[許可区分（建築）]])),\"D\",\"-\"))","v":"A"},{"$f":"IF(NOT(ISBLANK(テーブル63[[#This Row],[電気]])),VLOOKUP(テーブル63[[#This Row],[電気]],電気[],2,TRUE), IF(NOT(ISBLANK(テーブル63[[#This Row],[許可区分（電気）]])),\"D\",\"-\"))","v":"A"},{"$f":"IF(NOT(ISBLANK(テーブル63[[#This Row],[管]])),VLOOKUP(テーブル63[[#This Row],[管]],管[],2,TRUE), IF(NOT(ISBLANK(テーブル63[[#This Row],[許可区分（管）]])),\"D\",\"-\"))","v":"A"},{"$f":"IF(NOT(ISBLANK(テーブル63[[#This Row],[ほ装]])),VLOOKUP(テーブル63[[#This Row],[ほ装]],ほ装[],2,TRUE), IF(NOT(ISBLANK(テーブル63[[#This Row],[許可区分(ほ装)]])),\"D\",\"-\"))","v":"A"},{"$f":"IF(NOT(ISBLANK(テーブル63[[#This Row],[塗装]])),VLOOKUP(テーブル63[[#This Row],[塗装]],塗装[],2,TRUE), IF(NOT(ISBLANK(テーブル63[[#This Row],[許可区分（塗装）]])),\"D\",\"-\"))","v":"A"},{"$f":"IF(NOT(ISBLANK(テーブル63[[#This Row],[防水]])),VLOOKUP(テーブル63[[#This Row],[防水]],塗装[],2,TRUE), IF(NOT(ISBLANK(テーブル63[[#This Row],[許可区分（防水）]])),\"D\",\"-\"))","v":"A"},{"$f":"IF(NOT(ISBLANK(テーブル63[[#This Row],[機械器具設置]])),VLOOKUP(テーブル63[[#This Row],[機械器具設置]],塗装[],2,TRUE), IF(NOT(ISBLANK(テーブル63[[#This Row],[許可区分（機械器具）]])),\"D\",\"-\"))","v":"-"},{"$f":"IF(NOT(ISBLANK(テーブル63[[#This Row],[電気通信]])),VLOOKUP(テーブル63[[#This Row],[電気通信]],電気[],2,TRUE), IF(NOT(ISBLANK(テーブル63[[#This Row],[許可区分(電気)]])),\"D\",\"-\"))","v":"-"},{"$f":"IF(NOT(ISBLANK(テーブル63[[#This Row],[水道施設]])),VLOOKUP(テーブル63[[#This Row],[水道施設]],水道[],2,TRUE), IF(NOT(ISBLANK(テーブル63[[#This Row],[許可区分（水道施設）]])),\"D\",\"-\"))","v":"A"}]
[44,"県内","㈱前澤エンジニアリングサービス　関東支店","千葉市中央区新宿2-5-16　LKパークビル４階","加藤　忠","043-247-5671","043-247-5672",null,null,null,null,null,null,"特定",854,null,null,null,null,null,null,"特定",1197,null,null,"特定",1105,{"$f":"IF(NOT(ISBLANK(テーブル63[[#This Row],[土木一式]])),VLOOKUP(テーブル63[[#This Row],[土木一式]],土木[],2,TRUE), IF(NOT(ISBLANK(テーブル63[[#This Row],[許可区分(土木)]])),\"D\",\"-\"))","v":"-"},{"$f":"IF(NOT(ISBLANK(テーブル63[[#This Row],[建築一式]])),VLOOKUP(テーブル63[[#This Row],[建築一式]],建築[],2,TRUE), IF(NOT(ISBLANK(テーブル63[[#This Row],[許可区分（建築）]])),\"D\",\"-\"))","v":"-"},{"$f":"IF(NOT(ISBLANK(テーブル63[[#This Row],[電気]])),VLOOKUP(テーブル63[[#This Row],[電気]],電気[],2,TRUE), IF(NOT(ISBLANK(テーブル63[[#This Row],[許可区分（電気）]])),\"D\",\"-\"))","v":"-"},{"$f":"IF(NOT(ISBLANK(テーブル63[[#This Row],[管]])),VLOOKUP(テーブル63[[#This Row],[管]],管[],2,TRUE), IF(NOT(ISBLANK(テーブル63[[#This Row],[許可区分（管）]])),\"D\",\"-\"))","v":"A"},{"$f":"IF(NOT(ISBLANK(テーブル63[[#This Row],[ほ装]])),VLOOKUP(テーブル63[[#This Row],[ほ装]],ほ装[],2,TRUE), IF(NOT(ISBLANK(テーブル63[[#This Row],[許可区分(ほ装)]])),\"D\",\"-\"))","v":"-"},{"$f":"IF(NOT(ISBLANK(テーブル63[[#This Row],[塗装]])),VLOOKUP(テーブル63[[#This Row],[塗装]],塗装[],2,TRUE), IF(NOT(ISBLANK(テーブル63[[#This Row],[許可区分（塗装）]])),\"D\",\"-\"))","v":"-"},{"$f":"IF(NOT(ISBLANK(テーブル63[[#This Row],[防水]])),VLOOKUP(テーブル63[[#This Row],[防水]],塗装[],2,TRUE), IF(NOT(ISBLANK(テーブル63[[#This Row],[許可区分（防水）]])),\"D\",\"-\"))","v":"-"},{"$f":"IF(NOT(ISBLANK(テーブル63[[#This Row],[機械器具設置]])),VLOOKUP(テーブル63[[#This Row],[機械器具設置]],塗装[],2,TRUE), IF(NOT(ISBLANK(テーブル63[[#This Row],[許可区分（機械器具）]])),\"D\",\"-\"))","v":"A"},{"$f":"IF(NOT(ISBLANK(テーブル63[[#This Row],[電気通信]])),VLOOKUP(テーブル63[[#This Row],[電気通信]],電気[],2,TRUE), IF(NOT(ISBLANK(テーブル63[[#This Row],[許可区分(電気)]])),\"D\",\"-\"))","v":"-"},{"$f":"IF(NOT(ISBLANK(テーブル63[[#This Row],[水道施設]])),VLOOKUP(テーブル63[[#This Row],[水道施設]],水道[],2,TRUE), IF(NOT(ISBLANK(テーブル63[[#This Row],[許可区分（水道施設）]])),\"D\",\"-\"))","v":"A"}]
[45,"県内","宮川電気通信工業㈱","千葉市中央区院内1-2-1","宮川　光生","043-225-1311","043-222-1330",null,null,null,null,"一般",665,null,null,null,null,null,null,null,null,null,null,"一般",846,null,null,{"$f":"IF(NOT(ISBLANK(テーブル63[[#This Row],[土木一式]])),VLOOKUP(テーブル63[[#This Row],[土木一式]],土木[],2,TRUE), IF(NOT(ISBLANK(テーブル63[[#This Row],[許可区分(土木)]])),\"D\",\"-\"))","v":"-"},{"$f":"IF(NOT(ISBLANK(テーブル63[[#This Row],[建築一式]])),VLOOKUP(テーブル63[[#This Row],[建築一式]],建築[],2,TRUE), IF(NOT(ISBLANK(テーブル63[[#This Row],[許可区分（建築）]])),\"D\",\"-\"))","v":"-"},{"$f":"IF(NOT(ISBLANK(テーブル63[[#This Row],[電気]])),VLOOKUP(テーブル63[[#This Row],[電気]],電気[],2,TRUE), IF(NOT(ISBLANK(テーブル63[[#This Row],[許可区分（電気）]])),\"D\",\"-\"))","v":"C"},{"$f":"IF(NOT(ISBLANK(テーブル63[[#This Row],[管]])),VLOOKUP(テーブル63[[#This Row],[管]],管[],2,TRUE), IF(NOT(ISBLANK(テーブル63[[#This Row],[許可区分（管）]])),\"D\",\"-\"))","v":"-"},{"$f":"IF(NOT(ISBLANK(テーブル63[[#This Row],[ほ装]])),VLOOKUP(テーブル63[[#This Row],[ほ装]],ほ装[],2,TRUE), IF(NOT(ISBLANK(テーブル63[[#This Row],[許可区分(ほ装)]])),\"D\",\"-\"))","v":"-"},{"$f":"IF(NOT(ISBLANK(テーブル63[[#This Row],[塗装]])),VLOOKUP(テーブル63[[#This Row],[塗装]],塗装[],2,TRUE), IF(NOT(ISBLANK(テーブル63[[#This Row],[許可区分（塗装）]])),\"D\",\"-\"))","v":"-"},{"$f":"IF(NOT(ISBLANK(テーブル63[[#This Row],[防水]])),VLOOKUP(テーブル63[[#This Row],[防水]],塗装[],2,TRUE), IF(NOT(ISBLANK(テーブル63[[#This Row],[許可区分（防水）]])),\"D\",\"-\"))","v":"-"},{"$f":"IF(NOT(ISBLANK(テーブル63[[#This Row],[機械器具設置]])),VLOOKUP(テーブル63[[#This Row],[機械器具設置]],塗装[],2,TRUE), IF(NOT(ISBLANK(テーブル63[[#This Row],[許可区分（機械器具）]])),\"D\",\"-\"))","v":"-"},{"$f":"IF(NOT(ISBLANK(テーブル63[[#This Row],[電気通信]])),VLOOKUP(テーブル63[[#This Row],[電気通信]],電気[],2,TRUE), IF(NOT(ISBLANK(テーブル63[[#This Row],[許可区分(電気)]])),\"D\",\"-\"))","v":"A"},{"$f":"IF(NOT(ISBLANK(テーブル63[[#This Row],[水道施設]])),VLOOKUP(テーブル63[[#This Row],[水道施設]],水道[],2,TRUE), IF(NOT(ISBLANK(テーブル63[[#This Row],[許可区分（水道施設）]])),\"D\",\"-\"))","v":"-"}]
[46,"県内","㈱日立製作所　千葉支店","千葉市中央区新千葉1-4-3","長倉　一茂","043-247-8201","043-247-1426",null,null,null,null,"特定",1979,"特定",1545,null,null,null,null,null,null,"特定",1720,"特定",1588,"特定",1424,{"$f":"IF(NOT(ISBLANK(テーブル63[[#This Row],[土木一式]])),VLOOKUP(テーブル63[[#This Row],[土木一式]],土木[],2,TRUE), IF(NOT(ISBLANK(テーブル63[[#This Row],[許可区分(土木)]])),\"D\",\"-\"))","v":"-"},{"$f":"IF(NOT(ISBLANK(テーブル63[[#This Row],[建築一式]])),VLOOKUP(テーブル63[[#This Row],[建築一式]],建築[],2,TRUE), IF(NOT(ISBLANK(テーブル63[[#This Row],[許可区分（建築）]])),\"D\",\"-\"))","v":"-"},{"$f":"IF(NOT(ISBLANK(テーブル63[[#This Row],[電気]])),VLOOKUP(テーブル63[[#This Row],[電気]],電気[],2,TRUE), IF(NOT(ISBLANK(テーブル63[[#This Row],[許可区分（電気）]])),\"D\",\"-\"))","v":"A"},{"$f":"IF(NOT(ISBLANK(テーブル63[[#This Row],[管]])),VLOOKUP(テーブル63[[#This Row],[管]],管[],2,TRUE), IF(NOT(ISBLANK(テーブル63[[#This Row],[許可区分（管）]])),\"D\",\"-\"))","v":"A"},{"$f":"IF(NOT(ISBLANK(テーブル63[[#This Row],[ほ装]])),VLOOKUP(テーブル63[[#This Row],[ほ装]],ほ装[],2,TRUE), IF(NOT(ISBLANK(テーブル63[[#This Row],[許可区分(ほ装)]])),\"D\",\"-\"))","v":"-"},{"$f":"IF(NOT(ISBLANK(テーブル63[[#This Row],[塗装]])),VLOOKUP(テーブル63[[#This Row],[塗装]],塗装[],2,TRUE), IF(NOT(ISBLANK(テーブル63[[#This Row],[許可区分（塗装）]])),\"D\",\"-\"))","v":"-"},{"$f":"IF(NOT(ISBLANK(テーブル63[[#This Row],[防水]])),VLOOKUP(テーブル63[[#This Row],[防水]],塗装[],2,TRUE), IF(NOT(ISBLANK(テーブル63[[#This Row],[許可区分（防水）]])),\"D\",\"-\"))","v":"-"},{"$f":"IF(NOT(ISBLANK(テーブル63[[#This Row],[機械器具設置]])),VLOOKUP(テーブル63[[#This Row],[機械器具設置]],塗装[],2,TRUE), IF(NOT(ISBLANK(テーブル63[[#This Row],[許可区分（機械器具）]])),\"D\",\"-\"))","v":"A"},{"$f":"IF(NOT(ISBLANK(テーブル63[[#This Row],[電気通信]])),VLOOKUP(テーブル63[[#This Row],[電気通信]],電気[],2,TRUE), IF(NOT(ISBLANK(テーブル63[[#This Row],[許可区分(電気)]])),\"D\",\"-\"))","v":"A"},{"$f":"IF(NOT(ISBLANK(テーブル63[[#This Row],[水道施設]])),VLOOKUP(テーブル63[[#This Row],[水道施設]],水道[],2,TRUE), IF(NOT(ISBLANK(テーブル63[[#This Row],[許可区分（水道施設）]])),\"D\",\"-\"))","v":"A"}]
[47,"県内","福井電機㈱","千葉市中央区問屋町16-3","村杉　茂治","043-241-6333","043-241-6428",null,null,null,null,"特定",1226,"特定",1200,null,null,null,null,null,null,"特定",898,"一般",781,"特定",819,{"$f":"IF(NOT(ISBLANK(テーブル63[[#This Row],[土木一式]])),VLOOKUP(テーブル63[[#This Row],[土木一式]],土木[],2,TRUE), IF(NOT(ISBLANK(テーブル63[[#This Row],[許可区分(土木)]])),\"D\",\"-\"))","v":"-"},{"$f":"IF(NOT(ISBLANK(テーブル63[[#This Row],[建築一式]])),VLOOKUP(テーブル63[[#This Row],[建築一式]],建築[],2,TRUE), IF(NOT(ISBLANK(テーブル63[[#This Row],[許可区分（建築）]])),\"D\",\"-\"))","v":"-"},{"$f":"IF(NOT(ISBLANK(テーブル63[[#This Row],[電気]])),VLOOKUP(テーブル63[[#This Row],[電気]],電気[],2,TRUE), IF(NOT(ISBLANK(テーブル63[[#This Row],[許可区分（電気）]])),\"D\",\"-\"))","v":"A"},{"$f":"IF(NOT(ISBLANK(テーブル63[[#This Row],[管]])),VLOOKUP(テーブル63[[#This Row],[管]],管[],2,TRUE), IF(NOT(ISBLANK(テーブル63[[#This Row],[許可区分（管）]])),\"D\",\"-\"))","v":"A"},{"$f":"IF(NOT(ISBLANK(テーブル63[[#This Row],[ほ装]])),VLOOKUP(テーブル63[[#This Row],[ほ装]],ほ装[],2,TRUE), IF(NOT(ISBLANK(テーブル63[[#This Row],[許可区分(ほ装)]])),\"D\",\"-\"))","v":"-"},{"$f":"IF(NOT(ISBLANK(テーブル63[[#This Row],[塗装]])),VLOOKUP(テーブル63[[#This Row],[塗装]],塗装[],2,TRUE), IF(NOT(ISBLANK(テーブル63[[#This Row],[許可区分（塗装）]])),\"D\",\"-\"))","v":"-"},{"$f":"IF(NOT(ISBLANK(テーブル63[[#This Row],[防水]])),VLOOKUP(テーブル63[[#This Row],[防水]],塗装[],2,TRUE), IF(NOT(ISBLANK(テーブル63[[#This Row],[許可区分（防水）]])),\"D\",\"-\"))","v":"-"},{"$f":"IF(NOT(ISBLANK(テーブル63[[#This Row],[機械器具設置]])),VLOOKUP(テーブル63[[#This Row],[機械器具設置]],塗装[],2,TRUE), IF(NOT(ISBLANK(テーブル63[[#This Row],[許可区分（機械器具）]])),\"D\",\"-\"))","v":"A"},{"$f":"IF(NOT(ISBLANK(テーブル63[[#This Row],[電気通信]])),VLOOKUP(テーブル63[[#This Row],[電気通信]],電気[],2,TRUE), IF(NOT(ISBLANK(テーブル63[[#This Row],[許可区分(電気)]])),\"D\",\"-\"))","v":"B"},{"$f":"IF(NOT(ISBLANK(テーブル63[[#This Row],[水道施設]])),VLOOKUP(テーブル63[[#This Row],[水道施設]],水道[],2,TRUE), IF(NOT(ISBLANK(テーブル63[[#This Row],[許可区分（水道施設）]])),\"D\",\"-\"))","v":"A"}]
[48,"県内","宮田塗装工業㈱","市原市山木990","宮田　徳太郎","0436-41-7570","0436-41-7580",null,null,"一般",640,null,null,null,null,null,null,"一般",824,"一般",738,null,null,null,null,null,null,{"$f":"IF(NOT(ISBLANK(テーブル63[[#This Row],[土木一式]])),VLOOKUP(テーブル63[[#This Row],[土木一式]],土木[],2,TRUE), IF(NOT(ISBLANK(テーブル63[[#This Row],[許可区分(土木)]])),\"D\",\"-\"))","v":"-"},{"$f":"IF(NOT(ISBLANK(テーブル63[[#This Row],[建築一式]])),VLOOKUP(テーブル63[[#This Row],[建築一式]],建築[],2,TRUE), IF(NOT(ISBLANK(テーブル63[[#This Row],[許可区分（建築）]])),\"D\",\"-\"))","v":"C"},{"$f":"IF(NOT(ISBLANK(テーブル63[[#This Row],[電気]])),VLOOKUP(テーブル63[[#This Row],[電気]],電気[],2,TRUE), IF(NOT(ISBLANK(テーブル63[[#This Row],[許可区分（電気）]])),\"D\",\"-\"))","v":"-"},{"$f":"IF(NOT(ISBLANK(テーブル63[[#This Row],[管]])),VLOOKUP(テーブル63[[#This Row],[管]],管[],2,TRUE), IF(NOT(ISBLANK(テーブル63[[#This Row],[許可区分（管）]])),\"D\",\"-\"))","v":"-"},{"$f":"IF(NOT(ISBLANK(テーブル63[[#This Row],[ほ装]])),VLOOKUP(テーブル63[[#This Row],[ほ装]],ほ装[],2,TRUE), IF(NOT(ISBLANK(テーブル63[[#This Row],[許可区分(ほ装)]])),\"D\",\"-\"))","v":"-"},{"$f":"IF(NOT(ISBLANK(テーブル63[[#This Row],[塗装]])),VLOOKUP(テーブル63[[#This Row],[塗装]],塗装[],2,TRUE), IF(NOT(ISBLANK(テーブル63[[#This Row],[許可区分（塗装）]])),\"D\",\"-\"))","v":"A"},{"$f":"IF(NOT(ISBLANK(テーブル63[[#This Row],[防水]])),VLOOKUP(テーブル63[[#This Row],[防水]],塗装[],2,TRUE), IF(NOT(ISBLANK(テーブル63[[#This Row],[許可区分（防水）]])),\"D\",\"-\"))","v":"B"},{"$f":"IF(NOT(ISBLANK(テーブル63[[#This Row],[機械器具設置]])),VLOOKUP(テーブル63[[#This Row],[機械器具設置]],塗装[],2,TRUE), IF(NOT(ISBLANK(テーブル63[[#This Row],[許可区分（機械器具）]])),\"D\",\"-\"))","v":"-"},{"$f":"IF(NOT(ISBLANK(テーブル63[[#This Row],[電気通信]])),VLOOKUP(テーブル63[[#This Row],[電気通信]],電気[],2,TRUE), IF(NOT(ISBLANK(テーブル63[[#This Row],[許可区分(電気)]])),\"D\",\"-\"))","v":"-"},{"$f":"IF(NOT(ISBLANK(テーブル63[[#This Row],[水道施設]])),VLOOKUP(テーブル63[[#This Row],[水道施設]],水道[],2,TRUE), IF(NOT(ISBLANK(テーブル63[[#This Row],[許可区分（水道施設）]])),\"D\",\"-\"))","v":"-"}]
[49,"県内","鈴木土建㈱","大網白里市細草1624-1","内山　弘通","0475-77-6111","0475-77-6115","特定",1035,"特定",855,null,null,"特定",820,"特定",880,"特定",723,"特定",723,null,null,null,null,"特定",874,{"$f":"IF(NOT(ISBLANK(テーブル63[[#This Row],[土木一式]])),VLOOKUP(テーブル63[[#This Row],[土木一式]],土木[],2,TRUE), IF(NOT(ISBLANK(テーブル63[[#This Row],[許可区分(土木)]])),\"D\",\"-\"))","v":"A"},{"$f":"IF(NOT(ISBLANK(テーブル63[[#This Row],[建築一式]])),VLOOKUP(テーブル63[[#This Row],[建築一式]],建築[],2,TRUE), IF(NOT(ISBLANK(テーブル63[[#This Row],[許可区分（建築）]])),\"D\",\"-\"))","v":"A"},{"$f":"IF(NOT(ISBLANK(テーブル63[[#This Row],[電気]])),VLOOKUP(テーブル63[[#This Row],[電気]],電気[],2,TRUE), IF(NOT(ISBLANK(テーブル63[[#This Row],[許可区分（電気）]])),\"D\",\"-\"))","v":"-"},{"$f":"IF(NOT(ISBLANK(テーブル63[[#This Row],[管]])),VLOOKUP(テーブル63[[#This Row],[管]],管[],2,TRUE), IF(NOT(ISBLANK(テーブル63[[#This Row],[許可区分（管）]])),\"D\",\"-\"))","v":"A"},{"$f":"IF(NOT(ISBLANK(テーブル63[[#This Row],[ほ装]])),VLOOKUP(テーブル63[[#This Row],[ほ装]],ほ装[],2,TRUE), IF(NOT(ISBLANK(テーブル63[[#This Row],[許可区分(ほ装)]])),\"D\",\"-\"))","v":"A"},{"$f":"IF(NOT(ISBLANK(テーブル63[[#This Row],[塗装]])),VLOOKUP(テーブル63[[#This Row],[塗装]],塗装[],2,TRUE), IF(NOT(ISBLANK(テーブル63[[#This Row],[許可区分（塗装）]])),\"D\",\"-\"))","v":"B"},{"$f":"IF(NOT(ISBLANK(テーブル63[[#This Row],[防水]])),VLOOKUP(テーブル63[[#This Row],[防水]],塗装[],2,TRUE), IF(NOT(ISBLANK(テーブル63[[#This Row],[許可区分（防水）]])),\"D\",\"-\"))","v":"B"},{"$f":"IF(NOT(ISBLANK(テーブル63[[#This Row],[機械器具設置]])),VLOOKUP(テーブル63[[#This Row],[機械器具設置]],塗装[],2,TRUE), IF(NOT(ISBLANK(テーブル63[[#This Row],[許可区分（機械器具）]])),\"D\",\"-\"))","v":"-"},{"$f":"IF(NOT(ISBLANK(テーブル63[[#This Row],[電気通信]])),VLOOKUP(テーブル63[[#This Row],[電気通信]],電気[],2,TRUE), IF(NOT(ISBLANK(テーブル63[[#This Row],[許可区分(電気)]])),\"D\",\"-\"))","v":"-"},{"$f":"IF(NOT(ISBLANK(テーブル63[[#This Row],[水道施設]])),VLOOKUP(テーブル63[[#This Row],[水道施設]],水道[],2,TRUE), IF(NOT(ISBLANK(テーブル63[[#This Row],[許可区分（水道施設）]])),\"D\",\"-\"))","v":"A"}]
[50,"県内","朝日塗装㈱","船橋市宮本3-2-2","髙橋　鉄郎","047-433-1511","047-431-3255",null,null,"特定",856,null,null,null,null,null,null,"特定",860,"特定",850,null,null,null,null,null,null,{"$f":"IF(NOT(ISBLANK(テーブル63[[#This Row],[土木一式]])),VLOOKUP(テーブル63[[#This Row],[土木一式]],土木[],2,TRUE), IF(NOT(ISBLANK(テーブル63[[#This Row],[許可区分(土木)]])),\"D\",\"-\"))","v":"-"},{"$f":"IF(NOT(ISBLANK(テーブル63[[#This Row],[建築一式]])),VLOOKUP(テーブル63[[#This Row],[建築一式]],建築[],2,TRUE), IF(NOT(ISBLANK(テーブル63[[#This Row],[許可区分（建築）]])),\"D\",\"-\"))","v":"A"},{"$f":"IF(NOT(ISBLANK(テーブル63[[#This Row],[電気]])),VLOOKUP(テーブル63[[#This Row],[電気]],電気[],2,TRUE), IF(NOT(ISBLANK(テーブル63[[#This Row],[許可区分（電気）]])),\"D\",\"-\"))","v":"-"},{"$f":"IF(NOT(ISBLANK(テーブル63[[#This Row],[管]])),VLOOKUP(テーブル63[[#This Row],[管]],管[],2,TRUE), IF(NOT(ISBLANK(テーブル63[[#This Row],[許可区分（管）]])),\"D\",\"-\"))","v":"-"},{"$f":"IF(NOT(ISBLANK(テーブル63[[#This Row],[ほ装]])),VLOOKUP(テーブル63[[#This Row],[ほ装]],ほ装[],2,TRUE), IF(NOT(ISBLANK(テーブル63[[#This Row],[許可区分(ほ装)]])),\"D\",\"-\"))","v":"-"},{"$f":"IF(NOT(ISBLANK(テーブル63[[#This Row],[塗装]])),VLOOKUP(テーブル63[[#This Row],[塗装]],塗装[],2,TRUE), IF(NOT(ISBLANK(テーブル63[[#This Row],[許可区分（塗装）]])),\"D\",\"-\"))","v":"A"},{"$f":"IF(NOT(ISBLANK(テーブル63[[#This Row],[防水]])),VLOOKUP(テーブル63[[#This Row],[防水]],塗装[],2,TRUE), IF(NOT(ISBLANK(テーブル63[[#This Row],[許可区分（防水）]])),\"D\",\"-\"))","v":"A"},{"$f":"IF(NOT(ISBLANK(テーブル63[[#This Row],[機械器具設置]])),VLOOKUP(テーブル63[[#This Row],[機械器具設置]],塗装[],2,TRUE), IF(NOT(ISBLANK(テーブル63[[#This Row],[許可区分（機械器具）]])),\"D\",\"-\"))","v":"-"},{"$f":"IF(NOT(ISBLANK(テーブル63[[#This Row],[電気通信]])),VLOOKUP(テーブル63[[#This Row],[電気通信]],電気[],2,TRUE), IF(NOT(ISBLANK(テーブル63[[#This Row],[許可区分(電気)]])),\"D\",\"-\"))","v":"-"},{"$f":"IF(NOT(ISBLANK(テーブル63[[#This Row],[水道施設]])),VLOOKUP(テーブル63[[#This Row],[水道施設]],水道[],2,TRUE), IF(NOT(ISBLANK(テーブル63[[#This Row],[許可区分（水道施設）]])),\"D\",\"-\"))","v":"-"}]
[51,"県内","㈱安藤建設","香取郡多古町多古3545-4","安藤　ゆみ","0479-76-5311","0479-76-5314","特定",954,null,null,null,null,"一般",677,"特定",876,null,null,null,null,null,null,null,null,"一般",677,{"$f":"IF(NOT(ISBLANK(テーブル63[[#This Row],[土木一式]])),VLOOKUP(テーブル63[[#This Row],[土木一式]],土木[],2,TRUE), IF(NOT(ISBLANK(テーブル63[[#This Row],[許可区分(土木)]])),\"D\",\"-\"))","v":"A"},{"$f":"IF(NOT(ISBLANK(テーブル63[[#This Row],[建築一式]])),VLOOKUP(テーブル63[[#This Row],[建築一式]],建築[],2,TRUE), IF(NOT(ISBLANK(テーブル63[[#This Row],[許可区分（建築）]])),\"D\",\"-\"))","v":"-"},{"$f":"IF(NOT(ISBLANK(テーブル63[[#This Row],[電気]])),VLOOKUP(テーブル63[[#This Row],[電気]],電気[],2,TRUE), IF(NOT(ISBLANK(テーブル63[[#This Row],[許可区分（電気）]])),\"D\",\"-\"))","v":"-"},{"$f":"IF(NOT(ISBLANK(テーブル63[[#This Row],[管]])),VLOOKUP(テーブル63[[#This Row],[管]],管[],2,TRUE), IF(NOT(ISBLANK(テーブル63[[#This Row],[許可区分（管）]])),\"D\",\"-\"))","v":"B"},{"$f":"IF(NOT(ISBLANK(テーブル63[[#This Row],[ほ装]])),VLOOKUP(テーブル63[[#This Row],[ほ装]],ほ装[],2,TRUE), IF(NOT(ISBLANK(テーブル63[[#This Row],[許可区分(ほ装)]])),\"D\",\"-\"))","v":"A"},{"$f":"IF(NOT(ISBLANK(テーブル63[[#This Row],[塗装]])),VLOOKUP(テーブル63[[#This Row],[塗装]],塗装[],2,TRUE), IF(NOT(ISBLANK(テーブル63[[#This Row],[許可区分（塗装）]])),\"D\",\"-\"))","v":"-"},{"$f":"IF(NOT(ISBLANK(テーブル63[[#This Row],[防水]])),VLOOKUP(テーブル63[[#This Row],[防水]],塗装[],2,TRUE), IF(NOT(ISBLANK(テーブル63[[#This Row],[許可区分（防水）]])),\"D\",\"-\"))","v":"-"},{"$f":"IF(NOT(ISBLANK(テーブル63[[#This Row],[機械器具設置]])),VLOOKUP(テーブル63[[#This Row],[機械器具設置]],塗装[],2,TRUE), IF(NOT(ISBLANK(テーブル63[[#This Row],[許可区分（機械器具）]])),\"D\",\"-\"))","v":"-"},{"$f":"IF(NOT(ISBLANK(テーブル63[[#This Row],[電気通信]])),VLOOKUP(テーブル63[[#This Row],[電気通信]],電気[],2,TRUE), IF(NOT(ISBLANK(テーブル63[[#This Row],[許可区分(電気)]])),\"D\",\"-\"))","v":"-"},{"$f":"IF(NOT(ISBLANK(テーブル63[[#This Row],[水道施設]])),VLOOKUP(テーブル63[[#This Row],[水道施設]],水道[],2,TRUE), IF(NOT(ISBLANK(テーブル63[[#This Row],[許可区分（水道施設）]])),\"D\",\"-\"))","v":"C"}]
[52,"県内","㈱進日本工業","千葉市美浜区中瀬二丁目6番地1　WBGマリブウエスト20F","臼倉　大介","043-441-4794","043-441-4925","特定",1044,null,null,null,null,"特定",1126,"特定",820,null,null,null,null,null,null,null,null,"特定",916,{"$f":"IF(NOT(ISBLANK(テーブル63[[#This Row],[土木一式]])),VLOOKUP(テーブル63[[#This Row],[土木一式]],土木[],2,TRUE), IF(NOT(ISBLANK(テーブル63[[#This Row],[許可区分(土木)]])),\"D\",\"-\"))","v":"A"},{"$f":"IF(NOT(ISBLANK(テーブル63[[#This Row],[建築一式]])),VLOOKUP(テーブル63[[#This Row],[建築一式]],建築[],2,TRUE), IF(NOT(ISBLANK(テーブル63[[#This Row],[許可区分（建築）]])),\"D\",\"-\"))","v":"-"},{"$f":"IF(NOT(ISBLANK(テーブル63[[#This Row],[電気]])),VLOOKUP(テーブル63[[#This Row],[電気]],電気[],2,TRUE), IF(NOT(ISBLANK(テーブル63[[#This Row],[許可区分（電気）]])),\"D\",\"-\"))","v":"-"},{"$f":"IF(NOT(ISBLANK(テーブル63[[#This Row],[管]])),VLOOKUP(テーブル63[[#This Row],[管]],管[],2,TRUE), IF(NOT(ISBLANK(テーブル63[[#This Row],[許可区分（管）]])),\"D\",\"-\"))","v":"A"},{"$f":"IF(NOT(ISBLANK(テーブル63[[#This Row],[ほ装]])),VLOOKUP(テーブル63[[#This Row],[ほ装]],ほ装[],2,TRUE), IF(NOT(ISBLANK(テーブル63[[#This Row],[許可区分(ほ装)]])),\"D\",\"-\"))","v":"A"},{"$f":"IF(NOT(ISBLANK(テーブル63[[#This Row],[塗装]])),VLOOKUP(テーブル63[[#This Row],[塗装]],塗装[],2,TRUE), IF(NOT(ISBLANK(テーブル63[[#This Row],[許可区分（塗装）]])),\"D\",\"-\"))","v":"-"},{"$f":"IF(NOT(ISBLANK(テーブル63[[#This Row],[防水]])),VLOOKUP(テーブル63[[#This Row],[防水]],塗装[],2,TRUE), IF(NOT(ISBLANK(テーブル63[[#This Row],[許可区分（防水）]])),\"D\",\"-\"))","v":"-"},{"$f":"IF(NOT(ISBLANK(テーブル63[[#This Row],[機械器具設置]])),VLOOKUP(テーブル63[[#This Row],[機械器具設置]],塗装[],2,TRUE), IF(NOT(ISBLANK(テーブル63[[#This Row],[許可区分（機械器具）]])),\"D\",\"-\"))","v":"-"},{"$f":"IF(NOT(ISBLANK(テーブル63[[#This Row],[電気通信]])),VLOOKUP(テーブル63[[#This Row],[電気通信]],電気[],2,TRUE), IF(NOT(ISBLANK(テーブル63[[#This Row],[許可区分(電気)]])),\"D\",\"-\"))","v":"-"},{"$f":"IF(NOT(ISBLANK(テーブル63[[#This Row],[水道施設]])),VLOOKUP(テーブル63[[#This Row],[水道施設]],水道[],2,TRUE), IF(NOT(ISBLANK(テーブル63[[#This Row],[許可区分（水道施設）]])),\"D\",\"-\"))","v":"A"}]
[53,"県内","㈱ボスダ","市川市大野町2-1890","細野　忠敏","047-339-5915","047-339-4828",null,null,null,null,null,null,"特定",837,null,null,null,null,null,null,null,null,null,null,null,null,{"$f":"IF(NOT(ISBLANK(テーブル63[[#This Row],[土木一式]])),VLOOKUP(テーブル63[[#This Row],[土木一式]],土木[],2,TRUE), IF(NOT(ISBLANK(テーブル63[[#This Row],[許可区分(土木)]])),\"D\",\"-\"))","v":"-"},{"$f":"IF(NOT(ISBLANK(テーブル63[[#This Row],[建築一式]])),VLOOKUP(テーブル63[[#This Row],[建築一式]],建築[],2,TRUE), IF(NOT(ISBLANK(テーブル63[[#This Row],[許可区分（建築）]])),\"D\",\"-\"))","v":"-"},{"$f":"IF(NOT(ISBLANK(テーブル63[[#This Row],[電気]])),VLOOKUP(テーブル63[[#This Row],[電気]],電気[],2,TRUE), IF(NOT(ISBLANK(テーブル63[[#This Row],[許可区分（電気）]])),\"D\",\"-\"))","v":"-"},{"$f":"IF(NOT(ISBLANK(テーブル63[[#This Row],[管]])),VLOOKUP(テーブル63[[#This Row],[管]],管[],2,TRUE), IF(NOT(ISBLANK(テーブル63[[#This Row],[許可区分（管）]])),\"D\",\"-\"))","v":"A"},{"$f":"IF(NOT(ISBLANK(テーブル63[[#This Row],[ほ装]])),VLOOKUP(テーブル63[[#This Row],[ほ装]],ほ装[],2,TRUE), IF(NOT(ISBLANK(テーブル63[[#This Row],[許可区分(ほ装)]])),\"D\",\"-\"))","v":"-"},{"$f":"IF(NOT(ISBLANK(テーブル63[[#This Row],[塗装]])),VLOOKUP(テーブル63[[#This Row],[塗装]],塗装[],2,TRUE), IF(NOT(ISBLANK(テーブル63[[#This Row],[許可区分（塗装）]])),\"D\",\"-\"))","v":"-"},{"$f":"IF(NOT(ISBLANK(テーブル63[[#This Row],[防水]])),VLOOKUP(テーブル63[[#This Row],[防水]],塗装[],2,TRUE), IF(NOT(ISBLANK(テーブル63[[#This Row],[許可区分（防水）]])),\"D\",\"-\"))","v":"-"},{"$f":"IF(NOT(ISBLANK(テーブル63[[#This Row],[機械器具設置]])),VLOOKUP(テーブル63[[#This Row],[機械器具設置]],塗装[],2,TRUE), IF(NOT(ISBLANK(テーブル63[[#This Row],[許可区分（機械器具）]])),\"D\",\"-\"))","v":"-"},{"$f":"IF(NOT(ISBLANK(テーブル63[[#This Row],[電気通信]])),VLOOKUP(テーブル63[[#This Row],[電気通信]],電気[],2,TRUE), IF(NOT(ISBLANK(テーブル63[[#This Row],[許可区分(電気)]])),\"D\",\"-\"))","v":"-"},{"$f":"IF(NOT(ISBLANK(テーブル63[[#This Row],[水道施設]])),VLOOKUP(テーブル63[[#This Row],[水道施設]],水道[],2,TRUE), IF(NOT(ISBLANK(テーブル63[[#This Row],[許可区分（水道施設）]])),\"D\",\"-\"))","v":"-"}]
[54,"県内","㈱平野電設","成田市松崎264","平野　伸一","0476-26-8263","0476-26-9355",null,null,null,null,"特定",929,null,null,null,null,null,null,null,null,null,null,null,null,null,null,{"$f":"IF(NOT(ISBLANK(テーブル63[[#This Row],[土木一式]])),VLOOKUP(テーブル63[[#This Row],[土木一式]],土木[],2,TRUE), IF(NOT(ISBLANK(テーブル63[[#This Row],[許可区分(土木)]])),\"D\",\"-\"))","v":"-"},{"$f":"IF(NOT(ISBLANK(テーブル63[[#This Row],[建築一式]])),VLOOKUP(テーブル63[[#This Row],[建築一式]],建築[],2,TRUE), IF(NOT(ISBLANK(テーブル63[[#This Row],[許可区分（建築）]])),\"D\",\"-\"))","v":"-"},{"$f":"IF(NOT(ISBLANK(テーブル63[[#This Row],[電気]])),VLOOKUP(テーブル63[[#This Row],[電気]],電気[],2,TRUE), IF(NOT(ISBLANK(テーブル63[[#This Row],[許可区分（電気）]])),\"D\",\"-\"))","v":"A"},{"$f":"IF(NOT(ISBLANK(テーブル63[[#This Row],[管]])),VLOOKUP(テーブル63[[#This Row],[管]],管[],2,TRUE), IF(NOT(ISBLANK(テーブル63[[#This Row],[許可区分（管）]])),\"D\",\"-\"))","v":"-"},{"$f":"IF(NOT(ISBLANK(テーブル63[[#This Row],[ほ装]])),VLOOKUP(テーブル63[[#This Row],[ほ装]],ほ装[],2,TRUE), IF(NOT(ISBLANK(テーブル63[[#This Row],[許可区分(ほ装)]])),\"D\",\"-\"))","v":"-"},{"$f":"IF(NOT(ISBLANK(テーブル63[[#This Row],[塗装]])),VLOOKUP(テーブル63[[#This Row],[塗装]],塗装[],2,TRUE), IF(NOT(ISBLANK(テーブル63[[#This Row],[許可区分（塗装）]])),\"D\",\"-\"))","v":"-"},{"$f":"IF(NOT(ISBLANK(テーブル63[[#This Row],[防水]])),VLOOKUP(テーブル63[[#This Row],[防水]],塗装[],2,TRUE), IF(NOT(ISBLANK(テーブル63[[#This Row],[許可区分（防水）]])),\"D\",\"-\"))","v":"-"},{"$f":"IF(NOT(ISBLANK(テーブル63[[#This Row],[機械器具設置]])),VLOOKUP(テーブル63[[#This Row],[機械器具設置]],塗装[],2,TRUE), IF(NOT(ISBLANK(テーブル63[[#This Row],[許可区分（機械器具）]])),\"D\",\"-\"))","v":"-"},{"$f":"IF(NOT(ISBLANK(テーブル63[[#This Row],[電気通信]])),VLOOKUP(テーブル63[[#This Row],[電気通信]],電気[],2,TRUE), IF(NOT(ISBLANK(テーブル63[[#This Row],[許可区分(電気)]])),\"D\",\"-\"))","v":"-"},{"$f":"IF(NOT(ISBLANK(テーブル63[[#This Row],[水道施設]])),VLOOKUP(テーブル63[[#This Row],[水道施設]],水道[],2,TRUE), IF(NOT(ISBLANK(テーブル63[[#This Row],[許可区分（水道施設）]])),\"D\",\"-\"))","v":"-"}]
[55,"県内","藤英建設㈱","旭市ニ6292-4","藤代　剛志","0479-63-5878","0479-63-5992","特定",null,"特定",null,null,null,null,null,"特定",null,null,null,null,null,null,null,null,null,"特定",null,{"$f":"IF(NOT(ISBLANK(テーブル63[[#This Row],[土木一式]])),VLOOKUP(テーブル63[[#This Row],[土木一式]],土木[],2,TRUE), IF(NOT(ISBLANK(テーブル63[[#This Row],[許可区分(土木)]])),\"D\",\"-\"))","v":"D"},{"$f":"IF(NOT(ISBLANK(テーブル63[[#This Row],[建築一式]])),VLOOKUP(テーブル63[[#This Row],[建築一式]],建築[],2,TRUE), IF(NOT(ISBLANK(テーブル63[[#This Row],[許可区分（建築）]])),\"D\",\"-\"))","v":"D"},{"$f":"IF(NOT(ISBLANK(テーブル63[[#This Row],[電気]])),VLOOKUP(テーブル63[[#This Row],[電気]],電気[],2,TRUE), IF(NOT(ISBLANK(テーブル63[[#This Row],[許可区分（電気）]])),\"D\",\"-\"))","v":"-"},{"$f":"IF(NOT(ISBLANK(テーブル63[[#This Row],[管]])),VLOOKUP(テーブル63[[#This Row],[管]],管[],2,TRUE), IF(NOT(ISBLANK(テーブル63[[#This Row],[許可区分（管）]])),\"D\",\"-\"))","v":"-"},{"$f":"IF(NOT(ISBLANK(テーブル63[[#This Row],[ほ装]])),VLOOKUP(テーブル63[[#This Row],[ほ装]],ほ装[],2,TRUE), IF(NOT(ISBLANK(テーブル63[[#This Row],[許可区分(ほ装)]])),\"D\",\"-\"))","v":"D"},{"$f":"IF(NOT(ISBLANK(テーブル63[[#This Row],[塗装]])),VLOOKUP(テーブル63[[#This Row],[塗装]],塗装[],2,TRUE), IF(NOT(ISBLANK(テーブル63[[#This Row],[許可区分（塗装）]])),\"D\",\"-\"))","v":"-"},{"$f":"IF(NOT(ISBLANK(テーブル63[[#This Row],[防水]])),VLOOKUP(テーブル63[[#This Row],[防水]],塗装[],2,TRUE), IF(NOT(ISBLANK(テーブル63[[#This Row],[許可区分（防水）]])),\"D\",\"-\"))","v":"-"},{"$f":"IF(NOT(ISBLANK(テーブル63[[#This Row],[機械器具設置]])),VLOOKUP(テーブル63[[#This Row],[機械器具設置]],塗装[],2,TRUE), IF(NOT(ISBLANK(テーブル63[[#This Row],[許可区分（機械器具）]])),\"D\",\"-\"))","v":"-"},{"$f":"IF(NOT(ISBLANK(テーブル63[[#This Row],[電気通信]])),VLOOKUP(テーブル63[[#This Row],[電気通信]],電気[],2,TRUE), IF(NOT(ISBLANK(テーブル63[[#This Row],[許可区分(電気)]])),\"D\",\"-\"))","v":"-"},{"$f":"IF(NOT(ISBLANK(テーブル63[[#This Row],[水道施設]])),VLOOKUP(テーブル63[[#This Row],[水道施設]],水道[],2,TRUE), IF(NOT(ISBLANK(テーブル63[[#This Row],[許可区分（水道施設）]])),\"D\",\"-\"))","v":"D"}]
[56,"県内","㈱第一テクノ　千葉営業所","千葉市中央区今井2-14-5","竹村　信彦","043-209-9291","043-209-9293","特定",871,null,null,"特定",1381,"特定",1006,null,null,null,null,null,null,"特定",1332,"特定",1022,"特定",1106,{"$f":"IF(NOT(ISBLANK(テーブル63[[#This Row],[土木一式]])),VLOOKUP(テーブル63[[#This Row],[土木一式]],土木[],2,TRUE), IF(NOT(ISBLANK(テーブル63[[#This Row],[許可区分(土木)]])),\"D\",\"-\"))","v":"A"},{"$f":"IF(NOT(ISBLANK(テーブル63[[#This Row],[建築一式]])),VLOOKUP(テーブル63[[#This Row],[建築一式]],建築[],2,TRUE), IF(NOT(ISBLANK(テーブル63[[#This Row],[許可区分（建築）]])),\"D\",\"-\"))","v":"-"},{"$f":"IF(NOT(ISBLANK(テーブル63[[#This Row],[電気]])),VLOOKUP(テーブル63[[#This Row],[電気]],電気[],2,TRUE), IF(NOT(ISBLANK(テーブル63[[#This Row],[許可区分（電気）]])),\"D\",\"-\"))","v":"A"},{"$f":"IF(NOT(ISBLANK(テーブル63[[#This Row],[管]])),VLOOKUP(テーブル63[[#This Row],[管]],管[],2,TRUE), IF(NOT(ISBLANK(テーブル63[[#This Row],[許可区分（管）]])),\"D\",\"-\"))","v":"A"},{"$f":"IF(NOT(ISBLANK(テーブル63[[#This Row],[ほ装]])),VLOOKUP(テーブル63[[#This Row],[ほ装]],ほ装[],2,TRUE), IF(NOT(ISBLANK(テーブル63[[#This Row],[許可区分(ほ装)]])),\"D\",\"-\"))","v":"-"},{"$f":"IF(NOT(ISBLANK(テーブル63[[#This Row],[塗装]])),VLOOKUP(テーブル63[[#This Row],[塗装]],塗装[],2,TRUE), IF(NOT(ISBLANK(テーブル63[[#This Row],[許可区分（塗装）]])),\"D\",\"-\"))","v":"-"},{"$f":"IF(NOT(ISBLANK(テーブル63[[#This Row],[防水]])),VLOOKUP(テーブル63[[#This Row],[防水]],塗装[],2,TRUE), IF(NOT(ISBLANK(テーブル63[[#This Row],[許可区分（防水）]])),\"D\",\"-\"))","v":"-"},{"$f":"IF(NOT(ISBLANK(テーブル63[[#This Row],[機械器具設置]])),VLOOKUP(テーブル63[[#This Row],[機械器具設置]],塗装[],2,TRUE), IF(NOT(ISBLANK(テーブル63[[#This Row],[許可区分（機械器具）]])),\"D\",\"-\"))","v":"A"},{"$f":"IF(NOT(ISBLANK(テーブル63[[#This Row],[電気通信]])),VLOOKUP(テーブル63[[#This Row],[電気通信]],電気[],2,TRUE), IF(NOT(ISBLANK(テーブル63[[#This Row],[許可区分(電気)]])),\"D\",\"-\"))","v":"A"},{"$f":"IF(NOT(ISBLANK(テーブル63[[#This Row],[水道施設]])),VLOOKUP(テーブル63[[#This Row],[水道施設]],水道[],2,TRUE), IF(NOT(ISBLANK(テーブル63[[#This Row],[許可区分（水道施設）]])),\"D\",\"-\"))","v":"A"}]
[57,"県内","シンフォニアエンジニアリング㈱　千葉営業所","船橋市豊富町631-12","植田　隆二","047-457-5023","047-457-5024",null,null,null,null,"特定",1237,null,null,null,null,null,null,null,null,"一般",964,null,null,null,null,{"$f":"IF(NOT(ISBLANK(テーブル63[[#This Row],[土木一式]])),VLOOKUP(テーブル63[[#This Row],[土木一式]],土木[],2,TRUE), IF(NOT(ISBLANK(テーブル63[[#This Row],[許可区分(土木)]])),\"D\",\"-\"))","v":"-"},{"$f":"IF(NOT(ISBLANK(テーブル63[[#This Row],[建築一式]])),VLOOKUP(テーブル63[[#This Row],[建築一式]],建築[],2,TRUE), IF(NOT(ISBLANK(テーブル63[[#This Row],[許可区分（建築）]])),\"D\",\"-\"))","v":"-"},{"$f":"IF(NOT(ISBLANK(テーブル63[[#This Row],[電気]])),VLOOKUP(テーブル63[[#This Row],[電気]],電気[],2,TRUE), IF(NOT(ISBLANK(テーブル63[[#This Row],[許可区分（電気）]])),\"D\",\"-\"))","v":"A"},{"$f":"IF(NOT(ISBLANK(テーブル63[[#This Row],[管]])),VLOOKUP(テーブル63[[#This Row],[管]],管[],2,TRUE), IF(NOT(ISBLANK(テーブル63[[#This Row],[許可区分（管）]])),\"D\",\"-\"))","v":"-"},{"$f":"IF(NOT(ISBLANK(テーブル63[[#This Row],[ほ装]])),VLOOKUP(テーブル63[[#This Row],[ほ装]],ほ装[],2,TRUE), IF(NOT(ISBLANK(テーブル63[[#This Row],[許可区分(ほ装)]])),\"D\",\"-\"))","v":"-"},{"$f":"IF(NOT(ISBLANK(テーブル63[[#This Row],[塗装]])),VLOOKUP(テーブル63[[#This Row],[塗装]],塗装[],2,TRUE), IF(NOT(ISBLANK(テーブル63[[#This Row],[許可区分（塗装）]])),\"D\",\"-\"))","v":"-"},{"$f":"IF(NOT(ISBLANK(テーブル63[[#This Row],[防水]])),VLOOKUP(テーブル63[[#This Row],[防水]],塗装[],2,TRUE), IF(NOT(ISBLANK(テーブル63[[#This Row],[許可区分（防水）]])),\"D\",\"-\"))","v":"-"},{"$f":"IF(NOT(ISBLANK(テーブル63[[#This Row],[機械器具設置]])),VLOOKUP(テーブル63[[#This Row],[機械器具設置]],塗装[],2,TRUE), IF(NOT(ISBLANK(テーブル63[[#This Row],[許可区分（機械器具）]])),\"D\",\"-\"))","v":"A"},{"$f":"IF(NOT(ISBLANK(テーブル63[[#This Row],[電気通信]])),VLOOKUP(テーブル63[[#This Row],[電気通信]],電気[],2,TRUE), IF(NOT(ISBLANK(テーブル63[[#This Row],[許可区分(電気)]])),\"D\",\"-\"))","v":"-"},{"$f":"IF(NOT(ISBLANK(テーブル63[[#This Row],[水道施設]])),VLOOKUP(テーブル63[[#This Row],[水道施設]],水道[],2,TRUE), IF(NOT(ISBLANK(テーブル63[[#This Row],[許可区分（水道施設）]])),\"D\",\"-\"))","v":"-"}]
[58,"県内","㈱安部日鋼工業　千葉営業所","市川市南八幡5-11-12","近藤　正己","047-377-0742","047-712-7609","特定",1411,null,null,null,null,null,null,null,null,"特定",1017,null,null,null,null,null,null,"特定",1345,{"$f":"IF(NOT(ISBLANK(テーブル63[[#This Row],[土木一式]])),VLOOKUP(テーブル63[[#This Row],[土木一式]],土木[],2,TRUE), IF(NOT(ISBLANK(テーブル63[[#This Row],[許可区分(土木)]])),\"D\",\"-\"))","v":"A"},{"$f":"IF(NOT(ISBLANK(テーブル63[[#This Row],[建築一式]])),VLOOKUP(テーブル63[[#This Row],[建築一式]],建築[],2,TRUE), IF(NOT(ISBLANK(テーブル63[[#This Row],[許可区分（建築）]])),\"D\",\"-\"))","v":"-"},{"$f":"IF(NOT(ISBLANK(テーブル63[[#This Row],[電気]])),VLOOKUP(テーブル63[[#This Row],[電気]],電気[],2,TRUE), IF(NOT(ISBLANK(テーブル63[[#This Row],[許可区分（電気）]])),\"D\",\"-\"))","v":"-"},{"$f":"IF(NOT(ISBLANK(テーブル63[[#This Row],[管]])),VLOOKUP(テーブル63[[#This Row],[管]],管[],2,TRUE), IF(NOT(ISBLANK(テーブル63[[#This Row],[許可区分（管）]])),\"D\",\"-\"))","v":"-"},{"$f":"IF(NOT(ISBLANK(テーブル63[[#This Row],[ほ装]])),VLOOKUP(テーブル63[[#This Row],[ほ装]],ほ装[],2,TRUE), IF(NOT(ISBLANK(テーブル63[[#This Row],[許可区分(ほ装)]])),\"D\",\"-\"))","v":"-"},{"$f":"IF(NOT(ISBLANK(テーブル63[[#This Row],[塗装]])),VLOOKUP(テーブル63[[#This Row],[塗装]],塗装[],2,TRUE), IF(NOT(ISBLANK(テーブル63[[#This Row],[許可区分（塗装）]])),\"D\",\"-\"))","v":"A"},{"$f":"IF(NOT(ISBLANK(テーブル63[[#This Row],[防水]])),VLOOKUP(テーブル63[[#This Row],[防水]],塗装[],2,TRUE), IF(NOT(ISBLANK(テーブル63[[#This Row],[許可区分（防水）]])),\"D\",\"-\"))","v":"-"},{"$f":"IF(NOT(ISBLANK(テーブル63[[#This Row],[機械器具設置]])),VLOOKUP(テーブル63[[#This Row],[機械器具設置]],塗装[],2,TRUE), IF(NOT(ISBLANK(テーブル63[[#This Row],[許可区分（機械器具）]])),\"D\",\"-\"))","v":"-"},{"$f":"IF(NOT(ISBLANK(テーブル63[[#This Row],[電気通信]])),VLOOKUP(テーブル63[[#This Row],[電気通信]],電気[],2,TRUE), IF(NOT(ISBLANK(テーブル63[[#This Row],[許可区分(電気)]])),\"D\",\"-\"))","v":"-"},{"$f":"IF(NOT(ISBLANK(テーブル63[[#This Row],[水道施設]])),VLOOKUP(テーブル63[[#This Row],[水道施設]],水道[],2,TRUE), IF(NOT(ISBLANK(テーブル63[[#This Row],[許可区分（水道施設）]])),\"D\",\"-\"))","v":"A"}]
[59,"県内","明和工業㈱　千葉営業所","松戸市根本2-12　ミヤザワビル9階","鎌田　将","047-711-9961","047-711-9962","特定",976,null,null,null,null,null,null,null,null,null,null,null,null,null,null,null,null,null,null,{"$f":"IF(NOT(ISBLANK(テーブル63[[#This Row],[土木一式]])),VLOOKUP(テーブル63[[#This Row],[土木一式]],土木[],2,TRUE), IF(NOT(ISBLANK(テーブル63[[#This Row],[許可区分(土木)]])),\"D\",\"-\"))","v":"A"},{"$f":"IF(NOT(ISBLANK(テーブル63[[#This Row],[建築一式]])),VLOOKUP(テーブル63[[#This Row],[建築一式]],建築[],2,TRUE), IF(NOT(ISBLANK(テーブル63[[#This Row],[許可区分（建築）]])),\"D\",\"-\"))","v":"-"},{"$f":"IF(NOT(ISBLANK(テーブル63[[#This Row],[電気]])),VLOOKUP(テーブル63[[#This Row],[電気]],電気[],2,TRUE), IF(NOT(ISBLANK(テーブル63[[#This Row],[許可区分（電気）]])),\"D\",\"-\"))","v":"-"},{"$f":"IF(NOT(ISBLANK(テーブル63[[#This Row],[管]])),VLOOKUP(テーブル63[[#This Row],[管]],管[],2,TRUE), IF(NOT(ISBLANK(テーブル63[[#This Row],[許可区分（管）]])),\"D\",\"-\"))","v":"-"},{"$f":"IF(NOT(ISBLANK(テーブル63[[#This Row],[ほ装]])),VLOOKUP(テーブル63[[#This Row],[ほ装]],ほ装[],2,TRUE), IF(NOT(ISBLANK(テーブル63[[#This Row],[許可区分(ほ装)]])),\"D\",\"-\"))","v":"-"},{"$f":"IF(NOT(ISBLANK(テーブル63[[#This Row],[塗装]])),VLOOKUP(テーブル63[[#This Row],[塗装]],塗装[],2,TRUE), IF(NOT(ISBLANK(テーブル63[[#This Row],[許可区分（塗装）]])),\"D\",\"-\"))","v":"-"},{"$f":"IF(NOT(ISBLANK(テーブル63[[#This Row],[防水]])),VLOOKUP(テーブル63[[#This Row],[防水]],塗装[],2,TRUE), IF(NOT(ISBLANK(テーブル63[[#This Row],[許可区分（防水）]])),\"D\",\"-\"))","v":"-"},{"$f":"IF(NOT(ISBLANK(テーブル63[[#This Row],[機械器具設置]])),VLOOKUP(テーブル63[[#This Row],[機械器具設置]],塗装[],2,TRUE), IF(NOT(ISBLANK(テーブル63[[#This Row],[許可区分（機械器具）]])),\"D\",\"-\"))","v":"-"},{"$f":"IF(NOT(ISBLANK(テーブル63[[#This Row],[電気通信]])),VLOOKUP(テーブル63[[#This Row],[電気通信]],電気[],2,TRUE), IF(NOT(ISBLANK(テーブル63[[#This Row],[許可区分(電気)]])),\"D\",\"-\"))","v":"-"},{"$f":"IF(NOT(ISBLANK(テーブル63[[#This Row],[水道施設]])),VLOOKUP(テーブル63[[#This Row],[水道施設]],水道[],2,TRUE), IF(NOT(ISBLANK(テーブル63[[#This Row],[許可区分（水道施設）]])),\"D\",\"-\"))","v":"-"}]
[60,"県内","㈱ヤオキ　","千葉市中央区仁戸名町131-18","堅田　栄治","043-261-4565","043-264-7562",null,null,"一般",777,null,null,null,null,null,null,"特定",882,"一般",753,null,null,null,null,null,null,{"$f":"IF(NOT(ISBLANK(テーブル63[[#This Row],[土木一式]])),VLOOKUP(テーブル63[[#This Row],[土木一式]],土木[],2,TRUE), IF(NOT(ISBLANK(テーブル63[[#This Row],[許可区分(土木)]])),\"D\",\"-\"))","v":"-"},{"$f":"IF(NOT(ISBLANK(テーブル63[[#This Row],[建築一式]])),VLOOKUP(テーブル63[[#This Row],[建築一式]],建築[],2,TRUE), IF(NOT(ISBLANK(テーブル63[[#This Row],[許可区分（建築）]])),\"D\",\"-\"))","v":"B"},{"$f":"IF(NOT(ISBLANK(テーブル63[[#This Row],[電気]])),VLOOKUP(テーブル63[[#This Row],[電気]],電気[],2,TRUE), IF(NOT(ISBLANK(テーブル63[[#This Row],[許可区分（電気）]])),\"D\",\"-\"))","v":"-"},{"$f":"IF(NOT(ISBLANK(テーブル63[[#This Row],[管]])),VLOOKUP(テーブル63[[#This Row],[管]],管[],2,TRUE), IF(NOT(ISBLANK(テーブル63[[#This Row],[許可区分（管）]])),\"D\",\"-\"))","v":"-"},{"$f":"IF(NOT(ISBLANK(テーブル63[[#This Row],[ほ装]])),VLOOKUP(テーブル63[[#This Row],[ほ装]],ほ装[],2,TRUE), IF(NOT(ISBLANK(テーブル63[[#This Row],[許可区分(ほ装)]])),\"D\",\"-\"))","v":"-"},{"$f":"IF(NOT(ISBLANK(テーブル63[[#This Row],[塗装]])),VLOOKUP(テーブル63[[#This Row],[塗装]],塗装[],2,TRUE), IF(NOT(ISBLANK(テーブル63[[#This Row],[許可区分（塗装）]])),\"D\",\"-\"))","v":"A"},{"$f":"IF(NOT(ISBLANK(テーブル63[[#This Row],[防水]])),VLOOKUP(テーブル63[[#This Row],[防水]],塗装[],2,TRUE), IF(NOT(ISBLANK(テーブル63[[#This Row],[許可区分（防水）]])),\"D\",\"-\"))","v":"B"},{"$f":"IF(NOT(ISBLANK(テーブル63[[#This Row],[機械器具設置]])),VLOOKUP(テーブル63[[#This Row],[機械器具設置]],塗装[],2,TRUE), IF(NOT(ISBLANK(テーブル63[[#This Row],[許可区分（機械器具）]])),\"D\",\"-\"))","v":"-"},{"$f":"IF(NOT(ISBLANK(テーブル63[[#This Row],[電気通信]])),VLOOKUP(テーブル63[[#This Row],[電気通信]],電気[],2,TRUE), IF(NOT(ISBLANK(テーブル63[[#This Row],[許可区分(電気)]])),\"D\",\"-\"))","v":"-"},{"$f":"IF(NOT(ISBLANK(テーブル63[[#This Row],[水道施設]])),VLOOKUP(テーブル63[[#This Row],[水道施設]],水道[],2,TRUE), IF(NOT(ISBLANK(テーブル63[[#This Row],[許可区分（水道施設）]])),\"D\",\"-\"))","v":"-"}]
[61,"県内","横河ｿﾘｭｰｼｮﾝｻｰﾋﾞｽ㈱　浜野営業所","千葉市中央区村田町1211","奥矢　毅","043-263-8370","043-263-8372",null,null,null,null,"特定",1547,"特定",1014,null,null,null,null,null,null,"特定",1178,"特定",1370,"特定",902,{"$f":"IF(NOT(ISBLANK(テーブル63[[#This Row],[土木一式]])),VLOOKUP(テーブル63[[#This Row],[土木一式]],土木[],2,TRUE), IF(NOT(ISBLANK(テーブル63[[#This Row],[許可区分(土木)]])),\"D\",\"-\"))","v":"-"},{"$f":"IF(NOT(ISBLANK(テーブル63[[#This Row],[建築一式]])),VLOOKUP(テーブル63[[#This Row],[建築一式]],建築[],2,TRUE), IF(NOT(ISBLANK(テーブル63[[#This Row],[許可区分（建築）]])),\"D\",\"-\"))","v":"-"},{"$f":"IF(NOT(ISBLANK(テーブル63[[#This Row],[電気]])),VLOOKUP(テーブル63[[#This Row],[電気]],電気[],2,TRUE), IF(NOT(ISBLANK(テーブル63[[#This Row],[許可区分（電気）]])),\"D\",\"-\"))","v":"A"},{"$f":"IF(NOT(ISBLANK(テーブル63[[#This Row],[管]])),VLOOKUP(テーブル63[[#This Row],[管]],管[],2,TRUE), IF(NOT(ISBLANK(テーブル63[[#This Row],[許可区分（管）]])),\"D\",\"-\"))","v":"A"},{"$f":"IF(NOT(ISBLANK(テーブル63[[#This Row],[ほ装]])),VLOOKUP(テーブル63[[#This Row],[ほ装]],ほ装[],2,TRUE), IF(NOT(ISBLANK(テーブル63[[#This Row],[許可区分(ほ装)]])),\"D\",\"-\"))","v":"-"},{"$f":"IF(NOT(ISBLANK(テーブル63[[#This Row],[塗装]])),VLOOKUP(テーブル63[[#This Row],[塗装]],塗装[],2,TRUE), IF(NOT(ISBLANK(テーブル63[[#This Row],[許可区分（塗装）]])),\"D\",\"-\"))","v":"-"},{"$f":"IF(NOT(ISBLANK(テーブル63[[#This Row],[防水]])),VLOOKUP(テーブル63[[#This Row],[防水]],塗装[],2,TRUE), IF(NOT(ISBLANK(テーブル63[[#This Row],[許可区分（防水）]])),\"D\",\"-\"))","v":"-"},{"$f":"IF(NOT(ISBLANK(テーブル63[[#This Row],[機械器具設置]])),VLOOKUP(テーブル63[[#This Row],[機械器具設置]],塗装[],2,TRUE), IF(NOT(ISBLANK(テーブル63[[#This Row],[許可区分（機械器具）]])),\"D\",\"-\"))","v":"A"},{"$f":"IF(NOT(ISBLANK(テーブル63[[#This Row],[電気通信]])),VLOOKUP(テーブル63[[#This Row],[電気通信]],電気[],2,TRUE), IF(NOT(ISBLANK(テーブル63[[#This Row],[許可区分(電気)]])),\"D\",\"-\"))","v":"A"},{"$f":"IF(NOT(ISBLANK(テーブル63[[#This Row],[水道施設]])),VLOOKUP(テーブル63[[#This Row],[水道施設]],水道[],2,TRUE), IF(NOT(ISBLANK(テーブル63[[#This Row],[許可区分（水道施設）]])),\"D\",\"-\"))","v":"A"}]
[62,"県内","西松建設㈱　東関東営業所","千葉市中央区富士見2-3-1　塚本大千葉ビル９階","和泉　英雄","043-223-5573","043-223-5873","特定",1945,"特定",1953,null,null,null,null,"特定",1229,"特定",1248,"特定",1277,null,null,null,null,"特定",1457,{"$f":"IF(NOT(ISBLANK(テーブル63[[#This Row],[土木一式]])),VLOOKUP(テーブル63[[#This Row],[土木一式]],土木[],2,TRUE), IF(NOT(ISBLANK(テーブル63[[#This Row],[許可区分(土木)]])),\"D\",\"-\"))","v":"A"},{"$f":"IF(NOT(ISBLANK(テーブル63[[#This Row],[建築一式]])),VLOOKUP(テーブル63[[#This Row],[建築一式]],建築[],2,TRUE), IF(NOT(ISBLANK(テーブル63[[#This Row],[許可区分（建築）]])),\"D\",\"-\"))","v":"A"},{"$f":"IF(NOT(ISBLANK(テーブル63[[#This Row],[電気]])),VLOOKUP(テーブル63[[#This Row],[電気]],電気[],2,TRUE), IF(NOT(ISBLANK(テーブル63[[#This Row],[許可区分（電気）]])),\"D\",\"-\"))","v":"-"},{"$f":"IF(NOT(ISBLANK(テーブル63[[#This Row],[管]])),VLOOKUP(テーブル63[[#This Row],[管]],管[],2,TRUE), IF(NOT(ISBLANK(テーブル63[[#This Row],[許可区分（管）]])),\"D\",\"-\"))","v":"-"},{"$f":"IF(NOT(ISBLANK(テーブル63[[#This Row],[ほ装]])),VLOOKUP(テーブル63[[#This Row],[ほ装]],ほ装[],2,TRUE), IF(NOT(ISBLANK(テーブル63[[#This Row],[許可区分(ほ装)]])),\"D\",\"-\"))","v":"A"},{"$f":"IF(NOT(ISBLANK(テーブル63[[#This Row],[塗装]])),VLOOKUP(テーブル63[[#This Row],[塗装]],塗装[],2,TRUE), IF(NOT(ISBLANK(テーブル63[[#This Row],[許可区分（塗装）]])),\"D\",\"-\"))","v":"A"},{"$f":"IF(NOT(ISBLANK(テーブル63[[#This Row],[防水]])),VLOOKUP(テーブル63[[#This Row],[防水]],塗装[],2,TRUE), IF(NOT(ISBLANK(テーブル63[[#This Row],[許可区分（防水）]])),\"D\",\"-\"))","v":"A"},{"$f":"IF(NOT(ISBLANK(テーブル63[[#This Row],[機械器具設置]])),VLOOKUP(テーブル63[[#This Row],[機械器具設置]],塗装[],2,TRUE), IF(NOT(ISBLANK(テーブル63[[#This Row],[許可区分（機械器具）]])),\"D\",\"-\"))","v":"-"},{"$f":"IF(NOT(ISBLANK(テーブル63[[#This Row],[電気通信]])),VLOOKUP(テーブル63[[#This Row],[電気通信]],電気[],2,TRUE), IF(NOT(ISBLANK(テーブル63[[#This Row],[許可区分(電気)]])),\"D\",\"-\"))","v":"-"},{"$f":"IF(NOT(ISBLANK(テーブル63[[#This Row],[水道施設]])),VLOOKUP(テーブル63[[#This Row],[水道施設]],水道[],2,TRUE), IF(NOT(ISBLANK(テーブル63[[#This Row],[許可区分（水道施設）]])),\"D\",\"-\"))","v":"A"}]
[63,"県内","東亜建設工業㈱　千葉支店","千葉市中央区中央港1-12-3","中野　夏樹","043-242-2621","043-246-1703","特定",1782,"特定",1645,"特定",1110,null,null,"特定",983,null,null,null,null,null,null,null,null,"特定",1056,{"$f":"IF(NOT(ISBLANK(テーブル63[[#This Row],[土木一式]])),VLOOKUP(テーブル63[[#This Row],[土木一式]],土木[],2,TRUE), IF(NOT(ISBLANK(テーブル63[[#This Row],[許可区分(土木)]])),\"D\",\"-\"))","v":"A"},{"$f":"IF(NOT(ISBLANK(テーブル63[[#This Row],[建築一式]])),VLOOKUP(テーブル63[[#This Row],[建築一式]],建築[],2,TRUE), IF(NOT(ISBLANK(テーブル63[[#This Row],[許可区分（建築）]])),\"D\",\"-\"))","v":"A"},{"$f":"IF(NOT(ISBLANK(テーブル63[[#This Row],[電気]])),VLOOKUP(テーブル63[[#This Row],[電気]],電気[],2,TRUE), IF(NOT(ISBLANK(テーブル63[[#This Row],[許可区分（電気）]])),\"D\",\"-\"))","v":"A"},{"$f":"IF(NOT(ISBLANK(テーブル63[[#This Row],[管]])),VLOOKUP(テーブル63[[#This Row],[管]],管[],2,TRUE), IF(NOT(ISBLANK(テーブル63[[#This Row],[許可区分（管）]])),\"D\",\"-\"))","v":"-"},{"$f":"IF(NOT(ISBLANK(テーブル63[[#This Row],[ほ装]])),VLOOKUP(テーブル63[[#This Row],[ほ装]],ほ装[],2,TRUE), IF(NOT(ISBLANK(テーブル63[[#This Row],[許可区分(ほ装)]])),\"D\",\"-\"))","v":"A"},{"$f":"IF(NOT(ISBLANK(テーブル63[[#This Row],[塗装]])),VLOOKUP(テーブル63[[#This Row],[塗装]],塗装[],2,TRUE), IF(NOT(ISBLANK(テーブル63[[#This Row],[許可区分（塗装）]])),\"D\",\"-\"))","v":"-"},{"$f":"IF(NOT(ISBLANK(テーブル63[[#This Row],[防水]])),VLOOKUP(テーブル63[[#This Row],[防水]],塗装[],2,TRUE), IF(NOT(ISBLANK(テーブル63[[#This Row],[許可区分（防水）]])),\"D\",\"-\"))","v":"-"},{"$f":"IF(NOT(ISBLANK(テーブル63[[#This Row],[機械器具設置]])),VLOOKUP(テーブル63[[#This Row],[機械器具設置]],塗装[],2,TRUE), IF(NOT(ISBLANK(テーブル63[[#This Row],[許可区分（機械器具）]])),\"D\",\"-\"))","v":"-"},{"$f":"IF(NOT(ISBLANK(テーブル63[[#This Row],[電気通信]])),VLOOKUP(テーブル63[[#This Row],[電気通信]],電気[],2,TRUE), IF(NOT(ISBLANK(テーブル63[[#This Row],[許可区分(電気)]])),\"D\",\"-\"))","v":"-"},{"$f":"IF(NOT(ISBLANK(テーブル63[[#This Row],[水道施設]])),VLOOKUP(テーブル63[[#This Row],[水道施設]],水道[],2,TRUE), IF(NOT(ISBLANK(テーブル63[[#This Row],[許可区分（水道施設）]])),\"D\",\"-\"))","v":"A"}]
[64,"県内","平和防災㈱","千葉市稲毛区長沼原町774-2","佐藤　宜仁","043-257-4430","043-257-8597",null,null,null,null,"一般",647,null,null,null,null,null,null,null,null,null,null,"一般",755,null,null,{"$f":"IF(NOT(ISBLANK(テーブル63[[#This Row],[土木一式]])),VLOOKUP(テーブル63[[#This Row],[土木一式]],土木[],2,TRUE), IF(NOT(ISBLANK(テーブル63[[#This Row],[許可区分(土木)]])),\"D\",\"-\"))","v":"-"},{"$f":"IF(NOT(ISBLANK(テーブル63[[#This Row],[建築一式]])),VLOOKUP(テーブル63[[#This Row],[建築一式]],建築[],2,TRUE), IF(NOT(ISBLANK(テーブル63[[#This Row],[許可区分（建築）]])),\"D\",\"-\"))","v":"-"},{"$f":"IF(NOT(ISBLANK(テーブル63[[#This Row],[電気]])),VLOOKUP(テーブル63[[#This Row],[電気]],電気[],2,TRUE), IF(NOT(ISBLANK(テーブル63[[#This Row],[許可区分（電気）]])),\"D\",\"-\"))","v":"C"},{"$f":"IF(NOT(ISBLANK(テーブル63[[#This Row],[管]])),VLOOKUP(テーブル63[[#This Row],[管]],管[],2,TRUE), IF(NOT(ISBLANK(テーブル63[[#This Row],[許可区分（管）]])),\"D\",\"-\"))","v":"-"},{"$f":"IF(NOT(ISBLANK(テーブル63[[#This Row],[ほ装]])),VLOOKUP(テーブル63[[#This Row],[ほ装]],ほ装[],2,TRUE), IF(NOT(ISBLANK(テーブル63[[#This Row],[許可区分(ほ装)]])),\"D\",\"-\"))","v":"-"},{"$f":"IF(NOT(ISBLANK(テーブル63[[#This Row],[塗装]])),VLOOKUP(テーブル63[[#This Row],[塗装]],塗装[],2,TRUE), IF(NOT(ISBLANK(テーブル63[[#This Row],[許可区分（塗装）]])),\"D\",\"-\"))","v":"-"},{"$f":"IF(NOT(ISBLANK(テーブル63[[#This Row],[防水]])),VLOOKUP(テーブル63[[#This Row],[防水]],塗装[],2,TRUE), IF(NOT(ISBLANK(テーブル63[[#This Row],[許可区分（防水）]])),\"D\",\"-\"))","v":"-"},{"$f":"IF(NOT(ISBLANK(テーブル63[[#This Row],[機械器具設置]])),VLOOKUP(テーブル63[[#This Row],[機械器具設置]],塗装[],2,TRUE), IF(NOT(ISBLANK(テーブル63[[#This Row],[許可区分（機械器具）]])),\"D\",\"-\"))","v":"-"},{"$f":"IF(NOT(ISBLANK(テーブル63[[#This Row],[電気通信]])),VLOOKUP(テーブル63[[#This Row],[電気通信]],電気[],2,TRUE), IF(NOT(ISBLANK(テーブル63[[#This Row],[許可区分(電気)]])),\"D\",\"-\"))","v":"B"},{"$f":"IF(NOT(ISBLANK(テーブル63[[#This Row],[水道施設]])),VLOOKUP(テーブル63[[#This Row],[水道施設]],水道[],2,TRUE), IF(NOT(ISBLANK(テーブル63[[#This Row],[許可区分（水道施設）]])),\"D\",\"-\"))","v":"-"}]
[65,"県内","メタウォーター㈱　千葉営業所","千葉市中央区問屋町1-35","花田　真児","043-379-4847","043-379-4581",null,null,null,null,"特定",1724,null,null,null,null,null,null,null,null,"特定",1544,"特定",1401,"特定",1504,{"$f":"IF(NOT(ISBLANK(テーブル63[[#This Row],[土木一式]])),VLOOKUP(テーブル63[[#This Row],[土木一式]],土木[],2,TRUE), IF(NOT(ISBLANK(テーブル63[[#This Row],[許可区分(土木)]])),\"D\",\"-\"))","v":"-"},{"$f":"IF(NOT(ISBLANK(テーブル63[[#This Row],[建築一式]])),VLOOKUP(テーブル63[[#This Row],[建築一式]],建築[],2,TRUE), IF(NOT(ISBLANK(テーブル63[[#This Row],[許可区分（建築）]])),\"D\",\"-\"))","v":"-"},{"$f":"IF(NOT(ISBLANK(テーブル63[[#This Row],[電気]])),VLOOKUP(テーブル63[[#This Row],[電気]],電気[],2,TRUE), IF(NOT(ISBLANK(テーブル63[[#This Row],[許可区分（電気）]])),\"D\",\"-\"))","v":"A"},{"$f":"IF(NOT(ISBLANK(テーブル63[[#This Row],[管]])),VLOOKUP(テーブル63[[#This Row],[管]],管[],2,TRUE), IF(NOT(ISBLANK(テーブル63[[#This Row],[許可区分（管）]])),\"D\",\"-\"))","v":"-"},{"$f":"IF(NOT(ISBLANK(テーブル63[[#This Row],[ほ装]])),VLOOKUP(テーブル63[[#This Row],[ほ装]],ほ装[],2,TRUE), IF(NOT(ISBLANK(テーブル63[[#This Row],[許可区分(ほ装)]])),\"D\",\"-\"))","v":"-"},{"$f":"IF(NOT(ISBLANK(テーブル63[[#This Row],[塗装]])),VLOOKUP(テーブル63[[#This Row],[塗装]],塗装[],2,TRUE), IF(NOT(ISBLANK(テーブル63[[#This Row],[許可区分（塗装）]])),\"D\",\"-\"))","v":"-"},{"$f":"IF(NOT(ISBLANK(テーブル63[[#This Row],[防水]])),VLOOKUP(テーブル63[[#This Row],[防水]],塗装[],2,TRUE), IF(NOT(ISBLANK(テーブル63[[#This Row],[許可区分（防水）]])),\"D\",\"-\"))","v":"-"},{"$f":"IF(NOT(ISBLANK(テーブル63[[#This Row],[機械器具設置]])),VLOOKUP(テーブル63[[#This Row],[機械器具設置]],塗装[],2,TRUE), IF(NOT(ISBLANK(テーブル63[[#This Row],[許可区分（機械器具）]])),\"D\",\"-\"))","v":"A"},{"$f":"IF(NOT(ISBLANK(テーブル63[[#This Row],[電気通信]])),VLOOKUP(テーブル63[[#This Row],[電気通信]],電気[],2,TRUE), IF(NOT(ISBLANK(テーブル63[[#This Row],[許可区分(電気)]])),\"D\",\"-\"))","v":"A"},{"$f":"IF(NOT(ISBLANK(テーブル63[[#This Row],[水道施設]])),VLOOKUP(テーブル63[[#This Row],[水道施設]],水道[],2,TRUE), IF(NOT(ISBLANK(テーブル63[[#This Row],[許可区分（水道施設）]])),\"D\",\"-\"))","v":"A"}]
[66,"県内","モデン工業㈱","千葉市中央区松波3-11-19","関　泰之","043-255-1911","043-254-8533",null,null,null,null,"特定",1067,null,null,null,null,null,null,null,null,null,null,null,null,null,null,{"$f":"IF(NOT(ISBLANK(テーブル63[[#This Row],[土木一式]])),VLOOKUP(テーブル63[[#This Row],[土木一式]],土木[],2,TRUE), IF(NOT(ISBLANK(テーブル63[[#This Row],[許可区分(土木)]])),\"D\",\"-\"))","v":"-"},{"$f":"IF(NOT(ISBLANK(テーブル63[[#This Row],[建築一式]])),VLOOKUP(テーブル63[[#This Row],[建築一式]],建築[],2,TRUE), IF(NOT(ISBLANK(テーブル63[[#This Row],[許可区分（建築）]])),\"D\",\"-\"))","v":"-"},{"$f":"IF(NOT(ISBLANK(テーブル63[[#This Row],[電気]])),VLOOKUP(テーブル63[[#This Row],[電気]],電気[],2,TRUE), IF(NOT(ISBLANK(テーブル63[[#This Row],[許可区分（電気）]])),\"D\",\"-\"))","v":"A"},{"$f":"IF(NOT(ISBLANK(テーブル63[[#This Row],[管]])),VLOOKUP(テーブル63[[#This Row],[管]],管[],2,TRUE), IF(NOT(ISBLANK(テーブル63[[#This Row],[許可区分（管）]])),\"D\",\"-\"))","v":"-"},{"$f":"IF(NOT(ISBLANK(テーブル63[[#This Row],[ほ装]])),VLOOKUP(テーブル63[[#This Row],[ほ装]],ほ装[],2,TRUE), IF(NOT(ISBLANK(テーブル63[[#This Row],[許可区分(ほ装)]])),\"D\",\"-\"))","v":"-"},{"$f":"IF(NOT(ISBLANK(テーブル63[[#This Row],[塗装]])),VLOOKUP(テーブル63[[#This Row],[塗装]],塗装[],2,TRUE), IF(NOT(ISBLANK(テーブル63[[#This Row],[許可区分（塗装）]])),\"D\",\"-\"))","v":"-"},{"$f":"IF(NOT(ISBLANK(テーブル63[[#This Row],[防水]])),VLOOKUP(テーブル63[[#This Row],[防水]],塗装[],2,TRUE), IF(NOT(ISBLANK(テーブル63[[#This Row],[許可区分（防水）]])),\"D\",\"-\"))","v":"-"},{"$f":"IF(NOT(ISBLANK(テーブル63[[#This Row],[機械器具設置]])),VLOOKUP(テーブル63[[#This Row],[機械器具設置]],塗装[],2,TRUE), IF(NOT(ISBLANK(テーブル63[[#This Row],[許可区分（機械器具）]])),\"D\",\"-\"))","v":"-"},{"$f":"IF(NOT(ISBLANK(テーブル63[[#This Row],[電気通信]])),VLOOKUP(テーブル63[[#This Row],[電気通信]],電気[],2,TRUE), IF(NOT(ISBLANK(テーブル63[[#This Row],[許可区分(電気)]])),\"D\",\"-\"))","v":"-"},{"$f":"IF(NOT(ISBLANK(テーブル63[[#This Row],[水道施設]])),VLOOKUP(テーブル63[[#This Row],[水道施設]],水道[],2,TRUE), IF(NOT(ISBLANK(テーブル63[[#This Row],[許可区分（水道施設）]])),\"D\",\"-\"))","v":"-"}]
[67,"県内","有村建設㈱","佐倉市新臼井田6-13","有村　大","043-487-3115","043-487-3534","特定",954,null,null,null,null,"特定",811,"特定",946,null,null,null,null,null,null,null,null,"特定",718,{"$f":"IF(NOT(ISBLANK(テーブル63[[#This Row],[土木一式]])),VLOOKUP(テーブル63[[#This Row],[土木一式]],土木[],2,TRUE), IF(NOT(ISBLANK(テーブル63[[#This Row],[許可区分(土木)]])),\"D\",\"-\"))","v":"A"},{"$f":"IF(NOT(ISBLANK(テーブル63[[#This Row],[建築一式]])),VLOOKUP(テーブル63[[#This Row],[建築一式]],建築[],2,TRUE), IF(NOT(ISBLANK(テーブル63[[#This Row],[許可区分（建築）]])),\"D\",\"-\"))","v":"-"},{"$f":"IF(NOT(ISBLANK(テーブル63[[#This Row],[電気]])),VLOOKUP(テーブル63[[#This Row],[電気]],電気[],2,TRUE), IF(NOT(ISBLANK(テーブル63[[#This Row],[許可区分（電気）]])),\"D\",\"-\"))","v":"-"},{"$f":"IF(NOT(ISBLANK(テーブル63[[#This Row],[管]])),VLOOKUP(テーブル63[[#This Row],[管]],管[],2,TRUE), IF(NOT(ISBLANK(テーブル63[[#This Row],[許可区分（管）]])),\"D\",\"-\"))","v":"A"},{"$f":"IF(NOT(ISBLANK(テーブル63[[#This Row],[ほ装]])),VLOOKUP(テーブル63[[#This Row],[ほ装]],ほ装[],2,TRUE), IF(NOT(ISBLANK(テーブル63[[#This Row],[許可区分(ほ装)]])),\"D\",\"-\"))","v":"A"},{"$f":"IF(NOT(ISBLANK(テーブル63[[#This Row],[塗装]])),VLOOKUP(テーブル63[[#This Row],[塗装]],塗装[],2,TRUE), IF(NOT(ISBLANK(テーブル63[[#This Row],[許可区分（塗装）]])),\"D\",\"-\"))","v":"-"},{"$f":"IF(NOT(ISBLANK(テーブル63[[#This Row],[防水]])),VLOOKUP(テーブル63[[#This Row],[防水]],塗装[],2,TRUE), IF(NOT(ISBLANK(テーブル63[[#This Row],[許可区分（防水）]])),\"D\",\"-\"))","v":"-"},{"$f":"IF(NOT(ISBLANK(テーブル63[[#This Row],[機械器具設置]])),VLOOKUP(テーブル63[[#This Row],[機械器具設置]],塗装[],2,TRUE), IF(NOT(ISBLANK(テーブル63[[#This Row],[許可区分（機械器具）]])),\"D\",\"-\"))","v":"-"},{"$f":"IF(NOT(ISBLANK(テーブル63[[#This Row],[電気通信]])),VLOOKUP(テーブル63[[#This Row],[電気通信]],電気[],2,TRUE), IF(NOT(ISBLANK(テーブル63[[#This Row],[許可区分(電気)]])),\"D\",\"-\"))","v":"-"},{"$f":"IF(NOT(ISBLANK(テーブル63[[#This Row],[水道施設]])),VLOOKUP(テーブル63[[#This Row],[水道施設]],水道[],2,TRUE), IF(NOT(ISBLANK(テーブル63[[#This Row],[許可区分（水道施設）]])),\"D\",\"-\"))","v":"B"}]
[68,"県内","㈱協和エクシオ　千葉営業所","千葉市中央区新町24-9千葉ウエストビル","松﨑　洋仁","043-247-0072","043-248-0959","特定",1552,null,null,"特定",1665,null,null,"特定",1481,"特定",1189,null,null,null,null,"特定",1838,"特定",1172,{"$f":"IF(NOT(ISBLANK(テーブル63[[#This Row],[土木一式]])),VLOOKUP(テーブル63[[#This Row],[土木一式]],土木[],2,TRUE), IF(NOT(ISBLANK(テーブル63[[#This Row],[許可区分(土木)]])),\"D\",\"-\"))","v":"A"},{"$f":"IF(NOT(ISBLANK(テーブル63[[#This Row],[建築一式]])),VLOOKUP(テーブル63[[#This Row],[建築一式]],建築[],2,TRUE), IF(NOT(ISBLANK(テーブル63[[#This Row],[許可区分（建築）]])),\"D\",\"-\"))","v":"-"},{"$f":"IF(NOT(ISBLANK(テーブル63[[#This Row],[電気]])),VLOOKUP(テーブル63[[#This Row],[電気]],電気[],2,TRUE), IF(NOT(ISBLANK(テーブル63[[#This Row],[許可区分（電気）]])),\"D\",\"-\"))","v":"A"},{"$f":"IF(NOT(ISBLANK(テーブル63[[#This Row],[管]])),VLOOKUP(テーブル63[[#This Row],[管]],管[],2,TRUE), IF(NOT(ISBLANK(テーブル63[[#This Row],[許可区分（管）]])),\"D\",\"-\"))","v":"-"},{"$f":"IF(NOT(ISBLANK(テーブル63[[#This Row],[ほ装]])),VLOOKUP(テーブル63[[#This Row],[ほ装]],ほ装[],2,TRUE), IF(NOT(ISBLANK(テーブル63[[#This Row],[許可区分(ほ装)]])),\"D\",\"-\"))","v":"A"},{"$f":"IF(NOT(ISBLANK(テーブル63[[#This Row],[塗装]])),VLOOKUP(テーブル63[[#This Row],[塗装]],塗装[],2,TRUE), IF(NOT(ISBLANK(テーブル63[[#This Row],[許可区分（塗装）]])),\"D\",\"-\"))","v":"A"},{"$f":"IF(NOT(ISBLANK(テーブル63[[#This Row],[防水]])),VLOOKUP(テーブル63[[#This Row],[防水]],塗装[],2,TRUE), IF(NOT(ISBLANK(テーブル63[[#This Row],[許可区分（防水）]])),\"D\",\"-\"))","v":"-"},{"$f":"IF(NOT(ISBLANK(テーブル63[[#This Row],[機械器具設置]])),VLOOKUP(テーブル63[[#This Row],[機械器具設置]],塗装[],2,TRUE), IF(NOT(ISBLANK(テーブル63[[#This Row],[許可区分（機械器具）]])),\"D\",\"-\"))","v":"-"},{"$f":"IF(NOT(ISBLANK(テーブル63[[#This Row],[電気通信]])),VLOOKUP(テーブル63[[#This Row],[電気通信]],電気[],2,TRUE), IF(NOT(ISBLANK(テーブル63[[#This Row],[許可区分(電気)]])),\"D\",\"-\"))","v":"A"},{"$f":"IF(NOT(ISBLANK(テーブル63[[#This Row],[水道施設]])),VLOOKUP(テーブル63[[#This Row],[水道施設]],水道[],2,TRUE), IF(NOT(ISBLANK(テーブル63[[#This Row],[許可区分（水道施設）]])),\"D\",\"-\"))","v":"A"}]
[69,"県内","鉄建建設㈱　東関東支店","千葉市中央区新千葉1-7-3","島下　義晴","043-243-3572","043-243-3184","特定",1755,"特定",1722,null,null,null,null,null,null,null,null,null,null,null,null,null,null,"特定",1033,{"$f":"IF(NOT(ISBLANK(テーブル63[[#This Row],[土木一式]])),VLOOKUP(テーブル63[[#This Row],[土木一式]],土木[],2,TRUE), IF(NOT(ISBLANK(テーブル63[[#This Row],[許可区分(土木)]])),\"D\",\"-\"))","v":"A"},{"$f":"IF(NOT(ISBLANK(テーブル63[[#This Row],[建築一式]])),VLOOKUP(テーブル63[[#This Row],[建築一式]],建築[],2,TRUE), IF(NOT(ISBLANK(テーブル63[[#This Row],[許可区分（建築）]])),\"D\",\"-\"))","v":"A"},{"$f":"IF(NOT(ISBLANK(テーブル63[[#This Row],[電気]])),VLOOKUP(テーブル63[[#This Row],[電気]],電気[],2,TRUE), IF(NOT(ISBLANK(テーブル63[[#This Row],[許可区分（電気）]])),\"D\",\"-\"))","v":"-"},{"$f":"IF(NOT(ISBLANK(テーブル63[[#This Row],[管]])),VLOOKUP(テーブル63[[#This Row],[管]],管[],2,TRUE), IF(NOT(ISBLANK(テーブル63[[#This Row],[許可区分（管）]])),\"D\",\"-\"))","v":"-"},{"$f":"IF(NOT(ISBLANK(テーブル63[[#This Row],[ほ装]])),VLOOKUP(テーブル63[[#This Row],[ほ装]],ほ装[],2,TRUE), IF(NOT(ISBLANK(テーブル63[[#This Row],[許可区分(ほ装)]])),\"D\",\"-\"))","v":"-"},{"$f":"IF(NOT(ISBLANK(テーブル63[[#This Row],[塗装]])),VLOOKUP(テーブル63[[#This Row],[塗装]],塗装[],2,TRUE), IF(NOT(ISBLANK(テーブル63[[#This Row],[許可区分（塗装）]])),\"D\",\"-\"))","v":"-"},{"$f":"IF(NOT(ISBLANK(テーブル63[[#This Row],[防水]])),VLOOKUP(テーブル63[[#This Row],[防水]],塗装[],2,TRUE), IF(NOT(ISBLANK(テーブル63[[#This Row],[許可区分（防水）]])),\"D\",\"-\"))","v":"-"},{"$f":"IF(NOT(ISBLANK(テーブル63[[#This Row],[機械器具設置]])),VLOOKUP(テーブル63[[#This Row],[機械器具設置]],塗装[],2,TRUE), IF(NOT(ISBLANK(テーブル63[[#This Row],[許可区分（機械器具）]])),\"D\",\"-\"))","v":"-"},{"$f":"IF(NOT(ISBLANK(テーブル63[[#This Row],[電気通信]])),VLOOKUP(テーブル63[[#This Row],[電気通信]],電気[],2,TRUE), IF(NOT(ISBLANK(テーブル63[[#This Row],[許可区分(電気)]])),\"D\",\"-\"))","v":"-"},{"$f":"IF(NOT(ISBLANK(テーブル63[[#This Row],[水道施設]])),VLOOKUP(テーブル63[[#This Row],[水道施設]],水道[],2,TRUE), IF(NOT(ISBLANK(テーブル63[[#This Row],[許可区分（水道施設）]])),\"D\",\"-\"))","v":"A"}]
[70,"県内","㈱テクト","銚子市新生町1-40-18","高橋　裕","0479-22-9500","0479-25-1815","特定",921,"特定",917,null,null,null,null,"特定",788,null,null,null,null,null,null,null,null,"特定",623,{"$f":"IF(NOT(ISBLANK(テーブル63[[#This Row],[土木一式]])),VLOOKUP(テーブル63[[#This Row],[土木一式]],土木[],2,TRUE), IF(NOT(ISBLANK(テーブル63[[#This Row],[許可区分(土木)]])),\"D\",\"-\"))","v":"A"},{"$f":"IF(NOT(ISBLANK(テーブル63[[#This Row],[建築一式]])),VLOOKUP(テーブル63[[#This Row],[建築一式]],建築[],2,TRUE), IF(NOT(ISBLANK(テーブル63[[#This Row],[許可区分（建築）]])),\"D\",\"-\"))","v":"A"},{"$f":"IF(NOT(ISBLANK(テーブル63[[#This Row],[電気]])),VLOOKUP(テーブル63[[#This Row],[電気]],電気[],2,TRUE), IF(NOT(ISBLANK(テーブル63[[#This Row],[許可区分（電気）]])),\"D\",\"-\"))","v":"-"},{"$f":"IF(NOT(ISBLANK(テーブル63[[#This Row],[管]])),VLOOKUP(テーブル63[[#This Row],[管]],管[],2,TRUE), IF(NOT(ISBLANK(テーブル63[[#This Row],[許可区分（管）]])),\"D\",\"-\"))","v":"-"},{"$f":"IF(NOT(ISBLANK(テーブル63[[#This Row],[ほ装]])),VLOOKUP(テーブル63[[#This Row],[ほ装]],ほ装[],2,TRUE), IF(NOT(ISBLANK(テーブル63[[#This Row],[許可区分(ほ装)]])),\"D\",\"-\"))","v":"A"},{"$f":"IF(NOT(ISBLANK(テーブル63[[#This Row],[塗装]])),VLOOKUP(テーブル63[[#This Row],[塗装]],塗装[],2,TRUE), IF(NOT(ISBLANK(テーブル63[[#This Row],[許可区分（塗装）]])),\"D\",\"-\"))","v":"-"},{"$f":"IF(NOT(ISBLANK(テーブル63[[#This Row],[防水]])),VLOOKUP(テーブル63[[#This Row],[防水]],塗装[],2,TRUE), IF(NOT(ISBLANK(テーブル63[[#This Row],[許可区分（防水）]])),\"D\",\"-\"))","v":"-"},{"$f":"IF(NOT(ISBLANK(テーブル63[[#This Row],[機械器具設置]])),VLOOKUP(テーブル63[[#This Row],[機械器具設置]],塗装[],2,TRUE), IF(NOT(ISBLANK(テーブル63[[#This Row],[許可区分（機械器具）]])),\"D\",\"-\"))","v":"-"},{"$f":"IF(NOT(ISBLANK(テーブル63[[#This Row],[電気通信]])),VLOOKUP(テーブル63[[#This Row],[電気通信]],電気[],2,TRUE), IF(NOT(ISBLANK(テーブル63[[#This Row],[許可区分(電気)]])),\"D\",\"-\"))","v":"-"},{"$f":"IF(NOT(ISBLANK(テーブル63[[#This Row],[水道施設]])),VLOOKUP(テーブル63[[#This Row],[水道施設]],水道[],2,TRUE), IF(NOT(ISBLANK(テーブル63[[#This Row],[許可区分（水道施設）]])),\"D\",\"-\"))","v":"C"}]
[71,"県内","㈱錢高組　千葉支店","千葉市中央区今井1-12-8","鳥毛　修","043-263-8181","043-263-8186","特定",1629,"特定",1754,null,null,null,null,"特定",939,null,null,null,null,null,null,null,null,"特定",1290,{"$f":"IF(NOT(ISBLANK(テーブル63[[#This Row],[土木一式]])),VLOOKUP(テーブル63[[#This Row],[土木一式]],土木[],2,TRUE), IF(NOT(ISBLANK(テーブル63[[#This Row],[許可区分(土木)]])),\"D\",\"-\"))","v":"A"},{"$f":"IF(NOT(ISBLANK(テーブル63[[#This Row],[建築一式]])),VLOOKUP(テーブル63[[#This Row],[建築一式]],建築[],2,TRUE), IF(NOT(ISBLANK(テーブル63[[#This Row],[許可区分（建築）]])),\"D\",\"-\"))","v":"A"},{"$f":"IF(NOT(ISBLANK(テーブル63[[#This Row],[電気]])),VLOOKUP(テーブル63[[#This Row],[電気]],電気[],2,TRUE), IF(NOT(ISBLANK(テーブル63[[#This Row],[許可区分（電気）]])),\"D\",\"-\"))","v":"-"},{"$f":"IF(NOT(ISBLANK(テーブル63[[#This Row],[管]])),VLOOKUP(テーブル63[[#This Row],[管]],管[],2,TRUE), IF(NOT(ISBLANK(テーブル63[[#This Row],[許可区分（管）]])),\"D\",\"-\"))","v":"-"},{"$f":"IF(NOT(ISBLANK(テーブル63[[#This Row],[ほ装]])),VLOOKUP(テーブル63[[#This Row],[ほ装]],ほ装[],2,TRUE), IF(NOT(ISBLANK(テーブル63[[#This Row],[許可区分(ほ装)]])),\"D\",\"-\"))","v":"A"},{"$f":"IF(NOT(ISBLANK(テーブル63[[#This Row],[塗装]])),VLOOKUP(テーブル63[[#This Row],[塗装]],塗装[],2,TRUE), IF(NOT(ISBLANK(テーブル63[[#This Row],[許可区分（塗装）]])),\"D\",\"-\"))","v":"-"},{"$f":"IF(NOT(ISBLANK(テーブル63[[#This Row],[防水]])),VLOOKUP(テーブル63[[#This Row],[防水]],塗装[],2,TRUE), IF(NOT(ISBLANK(テーブル63[[#This Row],[許可区分（防水）]])),\"D\",\"-\"))","v":"-"},{"$f":"IF(NOT(ISBLANK(テーブル63[[#This Row],[機械器具設置]])),VLOOKUP(テーブル63[[#This Row],[機械器具設置]],塗装[],2,TRUE), IF(NOT(ISBLANK(テーブル63[[#This Row],[許可区分（機械器具）]])),\"D\",\"-\"))","v":"-"},{"$f":"IF(NOT(ISBLANK(テーブル63[[#This Row],[電気通信]])),VLOOKUP(テーブル63[[#This Row],[電気通信]],電気[],2,TRUE), IF(NOT(ISBLANK(テーブル63[[#This Row],[許可区分(電気)]])),\"D\",\"-\"))","v":"-"},{"$f":"IF(NOT(ISBLANK(テーブル63[[#This Row],[水道施設]])),VLOOKUP(テーブル63[[#This Row],[水道施設]],水道[],2,TRUE), IF(NOT(ISBLANK(テーブル63[[#This Row],[許可区分（水道施設）]])),\"D\",\"-\"))","v":"A"}]
[72,"県内","大崎電設㈱","市原市八幡北町1-11-4","武田　一衛","0436-43-2611","0436-43-5882",null,null,"一般",755,"特定",1013,"一般",820,null,null,null,null,null,null,"一般",715,"特定",782,null,null,{"$f":"IF(NOT(ISBLANK(テーブル63[[#This Row],[土木一式]])),VLOOKUP(テーブル63[[#This Row],[土木一式]],土木[],2,TRUE), IF(NOT(ISBLANK(テーブル63[[#This Row],[許可区分(土木)]])),\"D\",\"-\"))","v":"-"},{"$f":"IF(NOT(ISBLANK(テーブル63[[#This Row],[建築一式]])),VLOOKUP(テーブル63[[#This Row],[建築一式]],建築[],2,TRUE), IF(NOT(ISBLANK(テーブル63[[#This Row],[許可区分（建築）]])),\"D\",\"-\"))","v":"B"},{"$f":"IF(NOT(ISBLANK(テーブル63[[#This Row],[電気]])),VLOOKUP(テーブル63[[#This Row],[電気]],電気[],2,TRUE), IF(NOT(ISBLANK(テーブル63[[#This Row],[許可区分（電気）]])),\"D\",\"-\"))","v":"A"},{"$f":"IF(NOT(ISBLANK(テーブル63[[#This Row],[管]])),VLOOKUP(テーブル63[[#This Row],[管]],管[],2,TRUE), IF(NOT(ISBLANK(テーブル63[[#This Row],[許可区分（管）]])),\"D\",\"-\"))","v":"A"},{"$f":"IF(NOT(ISBLANK(テーブル63[[#This Row],[ほ装]])),VLOOKUP(テーブル63[[#This Row],[ほ装]],ほ装[],2,TRUE), IF(NOT(ISBLANK(テーブル63[[#This Row],[許可区分(ほ装)]])),\"D\",\"-\"))","v":"-"},{"$f":"IF(NOT(ISBLANK(テーブル63[[#This Row],[塗装]])),VLOOKUP(テーブル63[[#This Row],[塗装]],塗装[],2,TRUE), IF(NOT(ISBLANK(テーブル63[[#This Row],[許可区分（塗装）]])),\"D\",\"-\"))","v":"-"},{"$f":"IF(NOT(ISBLANK(テーブル63[[#This Row],[防水]])),VLOOKUP(テーブル63[[#This Row],[防水]],塗装[],2,TRUE), IF(NOT(ISBLANK(テーブル63[[#This Row],[許可区分（防水）]])),\"D\",\"-\"))","v":"-"},{"$f":"IF(NOT(ISBLANK(テーブル63[[#This Row],[機械器具設置]])),VLOOKUP(テーブル63[[#This Row],[機械器具設置]],塗装[],2,TRUE), IF(NOT(ISBLANK(テーブル63[[#This Row],[許可区分（機械器具）]])),\"D\",\"-\"))","v":"B"},{"$f":"IF(NOT(ISBLANK(テーブル63[[#This Row],[電気通信]])),VLOOKUP(テーブル63[[#This Row],[電気通信]],電気[],2,TRUE), IF(NOT(ISBLANK(テーブル63[[#This Row],[許可区分(電気)]])),\"D\",\"-\"))","v":"B"},{"$f":"IF(NOT(ISBLANK(テーブル63[[#This Row],[水道施設]])),VLOOKUP(テーブル63[[#This Row],[水道施設]],水道[],2,TRUE), IF(NOT(ISBLANK(テーブル63[[#This Row],[許可区分（水道施設）]])),\"D\",\"-\"))","v":"-"}]
[73,"県内","㈱淺沼組　千葉営業所","千葉市中央区新町3-13千葉TNビル","市村　光太郎","043-241-9063","043-246-6317","特定",1618,"特定",1830,"特定",1135,"特定",1236,"特定",1114,"特定",1011,"特定",1086,null,null,null,null,"特定",1365,{"$f":"IF(NOT(ISBLANK(テーブル63[[#This Row],[土木一式]])),VLOOKUP(テーブル63[[#This Row],[土木一式]],土木[],2,TRUE), IF(NOT(ISBLANK(テーブル63[[#This Row],[許可区分(土木)]])),\"D\",\"-\"))","v":"A"},{"$f":"IF(NOT(ISBLANK(テーブル63[[#This Row],[建築一式]])),VLOOKUP(テーブル63[[#This Row],[建築一式]],建築[],2,TRUE), IF(NOT(ISBLANK(テーブル63[[#This Row],[許可区分（建築）]])),\"D\",\"-\"))","v":"A"},{"$f":"IF(NOT(ISBLANK(テーブル63[[#This Row],[電気]])),VLOOKUP(テーブル63[[#This Row],[電気]],電気[],2,TRUE), IF(NOT(ISBLANK(テーブル63[[#This Row],[許可区分（電気）]])),\"D\",\"-\"))","v":"A"},{"$f":"IF(NOT(ISBLANK(テーブル63[[#This Row],[管]])),VLOOKUP(テーブル63[[#This Row],[管]],管[],2,TRUE), IF(NOT(ISBLANK(テーブル63[[#This Row],[許可区分（管）]])),\"D\",\"-\"))","v":"A"},{"$f":"IF(NOT(ISBLANK(テーブル63[[#This Row],[ほ装]])),VLOOKUP(テーブル63[[#This Row],[ほ装]],ほ装[],2,TRUE), IF(NOT(ISBLANK(テーブル63[[#This Row],[許可区分(ほ装)]])),\"D\",\"-\"))","v":"A"},{"$f":"IF(NOT(ISBLANK(テーブル63[[#This Row],[塗装]])),VLOOKUP(テーブル63[[#This Row],[塗装]],塗装[],2,TRUE), IF(NOT(ISBLANK(テーブル63[[#This Row],[許可区分（塗装）]])),\"D\",\"-\"))","v":"A"},{"$f":"IF(NOT(ISBLANK(テーブル63[[#This Row],[防水]])),VLOOKUP(テーブル63[[#This Row],[防水]],塗装[],2,TRUE), IF(NOT(ISBLANK(テーブル63[[#This Row],[許可区分（防水）]])),\"D\",\"-\"))","v":"A"},{"$f":"IF(NOT(ISBLANK(テーブル63[[#This Row],[機械器具設置]])),VLOOKUP(テーブル63[[#This Row],[機械器具設置]],塗装[],2,TRUE), IF(NOT(ISBLANK(テーブル63[[#This Row],[許可区分（機械器具）]])),\"D\",\"-\"))","v":"-"},{"$f":"IF(NOT(ISBLANK(テーブル63[[#This Row],[電気通信]])),VLOOKUP(テーブル63[[#This Row],[電気通信]],電気[],2,TRUE), IF(NOT(ISBLANK(テーブル63[[#This Row],[許可区分(電気)]])),\"D\",\"-\"))","v":"-"},{"$f":"IF(NOT(ISBLANK(テーブル63[[#This Row],[水道施設]])),VLOOKUP(テーブル63[[#This Row],[水道施設]],水道[],2,TRUE), IF(NOT(ISBLANK(テーブル63[[#This Row],[許可区分（水道施設）]])),\"D\",\"-\"))","v":"A"}]
[74,"県内","㈱増田電気工業所","千葉市若葉区都賀5-21-20","増田　健","043-231-5531","043-233-2831",null,null,null,null,"特定",892,null,null,null,null,null,null,null,null,null,null,null,null,null,null,{"$f":"IF(NOT(ISBLANK(テーブル63[[#This Row],[土木一式]])),VLOOKUP(テーブル63[[#This Row],[土木一式]],土木[],2,TRUE), IF(NOT(ISBLANK(テーブル63[[#This Row],[許可区分(土木)]])),\"D\",\"-\"))","v":"-"},{"$f":"IF(NOT(ISBLANK(テーブル63[[#This Row],[建築一式]])),VLOOKUP(テーブル63[[#This Row],[建築一式]],建築[],2,TRUE), IF(NOT(ISBLANK(テーブル63[[#This Row],[許可区分（建築）]])),\"D\",\"-\"))","v":"-"},{"$f":"IF(NOT(ISBLANK(テーブル63[[#This Row],[電気]])),VLOOKUP(テーブル63[[#This Row],[電気]],電気[],2,TRUE), IF(NOT(ISBLANK(テーブル63[[#This Row],[許可区分（電気）]])),\"D\",\"-\"))","v":"A"},{"$f":"IF(NOT(ISBLANK(テーブル63[[#This Row],[管]])),VLOOKUP(テーブル63[[#This Row],[管]],管[],2,TRUE), IF(NOT(ISBLANK(テーブル63[[#This Row],[許可区分（管）]])),\"D\",\"-\"))","v":"-"},{"$f":"IF(NOT(ISBLANK(テーブル63[[#This Row],[ほ装]])),VLOOKUP(テーブル63[[#This Row],[ほ装]],ほ装[],2,TRUE), IF(NOT(ISBLANK(テーブル63[[#This Row],[許可区分(ほ装)]])),\"D\",\"-\"))","v":"-"},{"$f":"IF(NOT(ISBLANK(テーブル63[[#This Row],[塗装]])),VLOOKUP(テーブル63[[#This Row],[塗装]],塗装[],2,TRUE), IF(NOT(ISBLANK(テーブル63[[#This Row],[許可区分（塗装）]])),\"D\",\"-\"))","v":"-"},{"$f":"IF(NOT(ISBLANK(テーブル63[[#This Row],[防水]])),VLOOKUP(テーブル63[[#This Row],[防水]],塗装[],2,TRUE), IF(NOT(ISBLANK(テーブル63[[#This Row],[許可区分（防水）]])),\"D\",\"-\"))","v":"-"},{"$f":"IF(NOT(ISBLANK(テーブル63[[#This Row],[機械器具設置]])),VLOOKUP(テーブル63[[#This Row],[機械器具設置]],塗装[],2,TRUE), IF(NOT(ISBLANK(テーブル63[[#This Row],[許可区分（機械器具）]])),\"D\",\"-\"))","v":"-"},{"$f":"IF(NOT(ISBLANK(テーブル63[[#This Row],[電気通信]])),VLOOKUP(テーブル63[[#This Row],[電気通信]],電気[],2,TRUE), IF(NOT(ISBLANK(テーブル63[[#This Row],[許可区分(電気)]])),\"D\",\"-\"))","v":"-"},{"$f":"IF(NOT(ISBLANK(テーブル63[[#This Row],[水道施設]])),VLOOKUP(テーブル63[[#This Row],[水道施設]],水道[],2,TRUE), IF(NOT(ISBLANK(テーブル63[[#This Row],[許可区分（水道施設）]])),\"D\",\"-\"))","v":"-"}]
[75,"県内","東芝インフラシステムズ㈱　東関東支店","千葉市美浜区中瀬2-6-1（WBGマリブイースト24階）","髙橋　義人","043-299-1009","043-299-1035",null,null,null,null,"特定",1821,null,null,null,null,null,null,null,null,null,null,"特定",1546,null,null,{"$f":"IF(NOT(ISBLANK(テーブル63[[#This Row],[土木一式]])),VLOOKUP(テーブル63[[#This Row],[土木一式]],土木[],2,TRUE), IF(NOT(ISBLANK(テーブル63[[#This Row],[許可区分(土木)]])),\"D\",\"-\"))","v":"-"},{"$f":"IF(NOT(ISBLANK(テーブル63[[#This Row],[建築一式]])),VLOOKUP(テーブル63[[#This Row],[建築一式]],建築[],2,TRUE), IF(NOT(ISBLANK(テーブル63[[#This Row],[許可区分（建築）]])),\"D\",\"-\"))","v":"-"},{"$f":"IF(NOT(ISBLANK(テーブル63[[#This Row],[電気]])),VLOOKUP(テーブル63[[#This Row],[電気]],電気[],2,TRUE), IF(NOT(ISBLANK(テーブル63[[#This Row],[許可区分（電気）]])),\"D\",\"-\"))","v":"A"},{"$f":"IF(NOT(ISBLANK(テーブル63[[#This Row],[管]])),VLOOKUP(テーブル63[[#This Row],[管]],管[],2,TRUE), IF(NOT(ISBLANK(テーブル63[[#This Row],[許可区分（管）]])),\"D\",\"-\"))","v":"-"},{"$f":"IF(NOT(ISBLANK(テーブル63[[#This Row],[ほ装]])),VLOOKUP(テーブル63[[#This Row],[ほ装]],ほ装[],2,TRUE), IF(NOT(ISBLANK(テーブル63[[#This Row],[許可区分(ほ装)]])),\"D\",\"-\"))","v":"-"},{"$f":"IF(NOT(ISBLANK(テーブル63[[#This Row],[塗装]])),VLOOKUP(テーブル63[[#This Row],[塗装]],塗装[],2,TRUE), IF(NOT(ISBLANK(テーブル63[[#This Row],[許可区分（塗装）]])),\"D\",\"-\"))","v":"-"},{"$f":"IF(NOT(ISBLANK(テーブル63[[#This Row],[防水]])),VLOOKUP(テーブル63[[#This Row],[防水]],塗装[],2,TRUE), IF(NOT(ISBLANK(テーブル63[[#This Row],[許可区分（防水）]])),\"D\",\"-\"))","v":"-"},{"$f":"IF(NOT(ISBLANK(テーブル63[[#This Row],[機械器具設置]])),VLOOKUP(テーブル63[[#This Row],[機械器具設置]],塗装[],2,TRUE), IF(NOT(ISBLANK(テーブル63[[#This Row],[許可区分（機械器具）]])),\"D\",\"-\"))","v":"-"},{"$f":"IF(NOT(ISBLANK(テーブル63[[#This Row],[電気通信]])),VLOOKUP(テーブル63[[#This Row],[電気通信]],電気[],2,TRUE), IF(NOT(ISBLANK(テーブル63[[#This Row],[許可区分(電気)]])),\"D\",\"-\"))","v":"A"},{"$f":"IF(NOT(ISBLANK(テーブル63[[#This Row],[水道施設]])),VLOOKUP(テーブル63[[#This Row],[水道施設]],水道[],2,TRUE), IF(NOT(ISBLANK(テーブル63[[#This Row],[許可区分（水道施設）]])),\"D\",\"-\"))","v":"-"}]
[76,"県内","㈱彩","千葉市若葉区加曽利町710","中島　康浩","043-214-0566","043-214-0810",null,null,null,null,null,null,null,null,null,null,"特定",820,"一般",725,null,null,null,null,null,null,{"$f":"IF(NOT(ISBLANK(テーブル63[[#This Row],[土木一式]])),VLOOKUP(テーブル63[[#This Row],[土木一式]],土木[],2,TRUE), IF(NOT(ISBLANK(テーブル63[[#This Row],[許可区分(土木)]])),\"D\",\"-\"))","v":"-"},{"$f":"IF(NOT(ISBLANK(テーブル63[[#This Row],[建築一式]])),VLOOKUP(テーブル63[[#This Row],[建築一式]],建築[],2,TRUE), IF(NOT(ISBLANK(テーブル63[[#This Row],[許可区分（建築）]])),\"D\",\"-\"))","v":"-"},{"$f":"IF(NOT(ISBLANK(テーブル63[[#This Row],[電気]])),VLOOKUP(テーブル63[[#This Row],[電気]],電気[],2,TRUE), IF(NOT(ISBLANK(テーブル63[[#This Row],[許可区分（電気）]])),\"D\",\"-\"))","v":"-"},{"$f":"IF(NOT(ISBLANK(テーブル63[[#This Row],[管]])),VLOOKUP(テーブル63[[#This Row],[管]],管[],2,TRUE), IF(NOT(ISBLANK(テーブル63[[#This Row],[許可区分（管）]])),\"D\",\"-\"))","v":"-"},{"$f":"IF(NOT(ISBLANK(テーブル63[[#This Row],[ほ装]])),VLOOKUP(テーブル63[[#This Row],[ほ装]],ほ装[],2,TRUE), IF(NOT(ISBLANK(テーブル63[[#This Row],[許可区分(ほ装)]])),\"D\",\"-\"))","v":"-"},{"$f":"IF(NOT(ISBLANK(テーブル63[[#This Row],[塗装]])),VLOOKUP(テーブル63[[#This Row],[塗装]],塗装[],2,TRUE), IF(NOT(ISBLANK(テーブル63[[#This Row],[許可区分（塗装）]])),\"D\",\"-\"))","v":"A"},{"$f":"IF(NOT(ISBLANK(テーブル63[[#This Row],[防水]])),VLOOKUP(テーブル63[[#This Row],[防水]],塗装[],2,TRUE), IF(NOT(ISBLANK(テーブル63[[#This Row],[許可区分（防水）]])),\"D\",\"-\"))","v":"B"},{"$f":"IF(NOT(ISBLANK(テーブル63[[#This Row],[機械器具設置]])),VLOOKUP(テーブル63[[#This Row],[機械器具設置]],塗装[],2,TRUE), IF(NOT(ISBLANK(テーブル63[[#This Row],[許可区分（機械器具）]])),\"D\",\"-\"))","v":"-"},{"$f":"IF(NOT(ISBLANK(テーブル63[[#This Row],[電気通信]])),VLOOKUP(テーブル63[[#This Row],[電気通信]],電気[],2,TRUE), IF(NOT(ISBLANK(テーブル63[[#This Row],[許可区分(電気)]])),\"D\",\"-\"))","v":"-"},{"$f":"IF(NOT(ISBLANK(テーブル63[[#This Row],[水道施設]])),VLOOKUP(テーブル63[[#This Row],[水道施設]],水道[],2,TRUE), IF(NOT(ISBLANK(テーブル63[[#This Row],[許可区分（水道施設）]])),\"D\",\"-\"))","v":"-"}]
[77,"県内","日本電気㈱　千葉支社","千葉市美浜区中瀬2-6-1","赤井　健志","043-351-7812","043-351-7817",null,null,null,null,"特定",1298,null,null,null,null,null,null,null,null,null,null,"特定",1718,null,null,{"$f":"IF(NOT(ISBLANK(テーブル63[[#This Row],[土木一式]])),VLOOKUP(テーブル63[[#This Row],[土木一式]],土木[],2,TRUE), IF(NOT(ISBLANK(テーブル63[[#This Row],[許可区分(土木)]])),\"D\",\"-\"))","v":"-"},{"$f":"IF(NOT(ISBLANK(テーブル63[[#This Row],[建築一式]])),VLOOKUP(テーブル63[[#This Row],[建築一式]],建築[],2,TRUE), IF(NOT(ISBLANK(テーブル63[[#This Row],[許可区分（建築）]])),\"D\",\"-\"))","v":"-"},{"$f":"IF(NOT(ISBLANK(テーブル63[[#This Row],[電気]])),VLOOKUP(テーブル63[[#This Row],[電気]],電気[],2,TRUE), IF(NOT(ISBLANK(テーブル63[[#This Row],[許可区分（電気）]])),\"D\",\"-\"))","v":"A"},{"$f":"IF(NOT(ISBLANK(テーブル63[[#This Row],[管]])),VLOOKUP(テーブル63[[#This Row],[管]],管[],2,TRUE), IF(NOT(ISBLANK(テーブル63[[#This Row],[許可区分（管）]])),\"D\",\"-\"))","v":"-"},{"$f":"IF(NOT(ISBLANK(テーブル63[[#This Row],[ほ装]])),VLOOKUP(テーブル63[[#This Row],[ほ装]],ほ装[],2,TRUE), IF(NOT(ISBLANK(テーブル63[[#This Row],[許可区分(ほ装)]])),\"D\",\"-\"))","v":"-"},{"$f":"IF(NOT(ISBLANK(テーブル63[[#This Row],[塗装]])),VLOOKUP(テーブル63[[#This Row],[塗装]],塗装[],2,TRUE), IF(NOT(ISBLANK(テーブル63[[#This Row],[許可区分（塗装）]])),\"D\",\"-\"))","v":"-"},{"$f":"IF(NOT(ISBLANK(テーブル63[[#This Row],[防水]])),VLOOKUP(テーブル63[[#This Row],[防水]],塗装[],2,TRUE), IF(NOT(ISBLANK(テーブル63[[#This Row],[許可区分（防水）]])),\"D\",\"-\"))","v":"-"},{"$f":"IF(NOT(ISBLANK(テーブル63[[#This Row],[機械器具設置]])),VLOOKUP(テーブル63[[#This Row],[機械器具設置]],塗装[],2,TRUE), IF(NOT(ISBLANK(テーブル63[[#This Row],[許可区分（機械器具）]])),\"D\",\"-\"))","v":"-"},{"$f":"IF(NOT(ISBLANK(テーブル63[[#This Row],[電気通信]])),VLOOKUP(テーブル63[[#This Row],[電気通信]],電気[],2,TRUE), IF(NOT(ISBLANK(テーブル63[[#This Row],[許可区分(電気)]])),\"D\",\"-\"))","v":"A"},{"$f":"IF(NOT(ISBLANK(テーブル63[[#This Row],[水道施設]])),VLOOKUP(テーブル63[[#This Row],[水道施設]],水道[],2,TRUE), IF(NOT(ISBLANK(テーブル63[[#This Row],[許可区分（水道施設）]])),\"D\",\"-\"))","v":"-"}]
[78,"県内","萩原土建㈱","山武郡芝山町大里1553-3","萩原　仁","0479-78-1131","0479-78-0646","特定",1096,null,null,null,null,null,null,"特定",930,null,null,null,null,null,null,null,null,"特定",775,{"$f":"IF(NOT(ISBLANK(テーブル63[[#This Row],[土木一式]])),VLOOKUP(テーブル63[[#This Row],[土木一式]],土木[],2,TRUE), IF(NOT(ISBLANK(テーブル63[[#This Row],[許可区分(土木)]])),\"D\",\"-\"))","v":"A"},{"$f":"IF(NOT(ISBLANK(テーブル63[[#This Row],[建築一式]])),VLOOKUP(テーブル63[[#This Row],[建築一式]],建築[],2,TRUE), IF(NOT(ISBLANK(テーブル63[[#This Row],[許可区分（建築）]])),\"D\",\"-\"))","v":"-"},{"$f":"IF(NOT(ISBLANK(テーブル63[[#This Row],[電気]])),VLOOKUP(テーブル63[[#This Row],[電気]],電気[],2,TRUE), IF(NOT(ISBLANK(テーブル63[[#This Row],[許可区分（電気）]])),\"D\",\"-\"))","v":"-"},{"$f":"IF(NOT(ISBLANK(テーブル63[[#This Row],[管]])),VLOOKUP(テーブル63[[#This Row],[管]],管[],2,TRUE), IF(NOT(ISBLANK(テーブル63[[#This Row],[許可区分（管）]])),\"D\",\"-\"))","v":"-"},{"$f":"IF(NOT(ISBLANK(テーブル63[[#This Row],[ほ装]])),VLOOKUP(テーブル63[[#This Row],[ほ装]],ほ装[],2,TRUE), IF(NOT(ISBLANK(テーブル63[[#This Row],[許可区分(ほ装)]])),\"D\",\"-\"))","v":"A"},{"$f":"IF(NOT(ISBLANK(テーブル63[[#This Row],[塗装]])),VLOOKUP(テーブル63[[#This Row],[塗装]],塗装[],2,TRUE), IF(NOT(ISBLANK(テーブル63[[#This Row],[許可区分（塗装）]])),\"D\",\"-\"))","v":"-"},{"$f":"IF(NOT(ISBLANK(テーブル63[[#This Row],[防水]])),VLOOKUP(テーブル63[[#This Row],[防水]],塗装[],2,TRUE), IF(NOT(ISBLANK(テーブル63[[#This Row],[許可区分（防水）]])),\"D\",\"-\"))","v":"-"},{"$f":"IF(NOT(ISBLANK(テーブル63[[#This Row],[機械器具設置]])),VLOOKUP(テーブル63[[#This Row],[機械器具設置]],塗装[],2,TRUE), IF(NOT(ISBLANK(テーブル63[[#This Row],[許可区分（機械器具）]])),\"D\",\"-\"))","v":"-"},{"$f":"IF(NOT(ISBLANK(テーブル63[[#This Row],[電気通信]])),VLOOKUP(テーブル63[[#This Row],[電気通信]],電気[],2,TRUE), IF(NOT(ISBLANK(テーブル63[[#This Row],[許可区分(電気)]])),\"D\",\"-\"))","v":"-"},{"$f":"IF(NOT(ISBLANK(テーブル63[[#This Row],[水道施設]])),VLOOKUP(テーブル63[[#This Row],[水道施設]],水道[],2,TRUE), IF(NOT(ISBLANK(テーブル63[[#This Row],[許可区分（水道施設）]])),\"D\",\"-\"))","v":"B"}]
[79,"県内","三峰無線㈱東関東支店","八千代市勝田台北１-20-15","折原　秀夫","047-485-1142","047-485-1108",null,null,null,null,null,null,null,null,null,null,null,null,null,null,null,null,"特定",1007,null,null,{"$f":"IF(NOT(ISBLANK(テーブル63[[#This Row],[土木一式]])),VLOOKUP(テーブル63[[#This Row],[土木一式]],土木[],2,TRUE), IF(NOT(ISBLANK(テーブル63[[#This Row],[許可区分(土木)]])),\"D\",\"-\"))","v":"-"},{"$f":"IF(NOT(ISBLANK(テーブル63[[#This Row],[建築一式]])),VLOOKUP(テーブル63[[#This Row],[建築一式]],建築[],2,TRUE), IF(NOT(ISBLANK(テーブル63[[#This Row],[許可区分（建築）]])),\"D\",\"-\"))","v":"-"},{"$f":"IF(NOT(ISBLANK(テーブル63[[#This Row],[電気]])),VLOOKUP(テーブル63[[#This Row],[電気]],電気[],2,TRUE), IF(NOT(ISBLANK(テーブル63[[#This Row],[許可区分（電気）]])),\"D\",\"-\"))","v":"-"},{"$f":"IF(NOT(ISBLANK(テーブル63[[#This Row],[管]])),VLOOKUP(テーブル63[[#This Row],[管]],管[],2,TRUE), IF(NOT(ISBLANK(テーブル63[[#This Row],[許可区分（管）]])),\"D\",\"-\"))","v":"-"},{"$f":"IF(NOT(ISBLANK(テーブル63[[#This Row],[ほ装]])),VLOOKUP(テーブル63[[#This Row],[ほ装]],ほ装[],2,TRUE), IF(NOT(ISBLANK(テーブル63[[#This Row],[許可区分(ほ装)]])),\"D\",\"-\"))","v":"-"},{"$f":"IF(NOT(ISBLANK(テーブル63[[#This Row],[塗装]])),VLOOKUP(テーブル63[[#This Row],[塗装]],塗装[],2,TRUE), IF(NOT(ISBLANK(テーブル63[[#This Row],[許可区分（塗装）]])),\"D\",\"-\"))","v":"-"},{"$f":"IF(NOT(ISBLANK(テーブル63[[#This Row],[防水]])),VLOOKUP(テーブル63[[#This Row],[防水]],塗装[],2,TRUE), IF(NOT(ISBLANK(テーブル63[[#This Row],[許可区分（防水）]])),\"D\",\"-\"))","v":"-"},{"$f":"IF(NOT(ISBLANK(テーブル63[[#This Row],[機械器具設置]])),VLOOKUP(テーブル63[[#This Row],[機械器具設置]],塗装[],2,TRUE), IF(NOT(ISBLANK(テーブル63[[#This Row],[許可区分（機械器具）]])),\"D\",\"-\"))","v":"-"},{"$f":"IF(NOT(ISBLANK(テーブル63[[#This Row],[電気通信]])),VLOOKUP(テーブル63[[#This Row],[電気通信]],電気[],2,TRUE), IF(NOT(ISBLANK(テーブル63[[#This Row],[許可区分(電気)]])),\"D\",\"-\"))","v":"A"},{"$f":"IF(NOT(ISBLANK(テーブル63[[#This Row],[水道施設]])),VLOOKUP(テーブル63[[#This Row],[水道施設]],水道[],2,TRUE), IF(NOT(ISBLANK(テーブル63[[#This Row],[許可区分（水道施設）]])),\"D\",\"-\"))","v":"-"}]
[80,"県内","三井住友建設㈱　東関東支店","千葉市美浜区中瀬2-6-1","森　徳章","043-299-0564","043-299-0577","特定",1937,"特定",1932,null,null,"特定",1329,"特定",1143,null,null,null,null,null,null,null,null,"特定",1614,{"$f":"IF(NOT(ISBLANK(テーブル63[[#This Row],[土木一式]])),VLOOKUP(テーブル63[[#This Row],[土木一式]],土木[],2,TRUE), IF(NOT(ISBLANK(テーブル63[[#This Row],[許可区分(土木)]])),\"D\",\"-\"))","v":"A"},{"$f":"IF(NOT(ISBLANK(テーブル63[[#This Row],[建築一式]])),VLOOKUP(テーブル63[[#This Row],[建築一式]],建築[],2,TRUE), IF(NOT(ISBLANK(テーブル63[[#This Row],[許可区分（建築）]])),\"D\",\"-\"))","v":"A"},{"$f":"IF(NOT(ISBLANK(テーブル63[[#This Row],[電気]])),VLOOKUP(テーブル63[[#This Row],[電気]],電気[],2,TRUE), IF(NOT(ISBLANK(テーブル63[[#This Row],[許可区分（電気）]])),\"D\",\"-\"))","v":"-"},{"$f":"IF(NOT(ISBLANK(テーブル63[[#This Row],[管]])),VLOOKUP(テーブル63[[#This Row],[管]],管[],2,TRUE), IF(NOT(ISBLANK(テーブル63[[#This Row],[許可区分（管）]])),\"D\",\"-\"))","v":"A"},{"$f":"IF(NOT(ISBLANK(テーブル63[[#This Row],[ほ装]])),VLOOKUP(テーブル63[[#This Row],[ほ装]],ほ装[],2,TRUE), IF(NOT(ISBLANK(テーブル63[[#This Row],[許可区分(ほ装)]])),\"D\",\"-\"))","v":"A"},{"$f":"IF(NOT(ISBLANK(テーブル63[[#This Row],[塗装]])),VLOOKUP(テーブル63[[#This Row],[塗装]],塗装[],2,TRUE), IF(NOT(ISBLANK(テーブル63[[#This Row],[許可区分（塗装）]])),\"D\",\"-\"))","v":"-"},{"$f":"IF(NOT(ISBLANK(テーブル63[[#This Row],[防水]])),VLOOKUP(テーブル63[[#This Row],[防水]],塗装[],2,TRUE), IF(NOT(ISBLANK(テーブル63[[#This Row],[許可区分（防水）]])),\"D\",\"-\"))","v":"-"},{"$f":"IF(NOT(ISBLANK(テーブル63[[#This Row],[機械器具設置]])),VLOOKUP(テーブル63[[#This Row],[機械器具設置]],塗装[],2,TRUE), IF(NOT(ISBLANK(テーブル63[[#This Row],[許可区分（機械器具）]])),\"D\",\"-\"))","v":"-"},{"$f":"IF(NOT(ISBLANK(テーブル63[[#This Row],[電気通信]])),VLOOKUP(テーブル63[[#This Row],[電気通信]],電気[],2,TRUE), IF(NOT(ISBLANK(テーブル63[[#This Row],[許可区分(電気)]])),\"D\",\"-\"))","v":"-"},{"$f":"IF(NOT(ISBLANK(テーブル63[[#This Row],[水道施設]])),VLOOKUP(テーブル63[[#This Row],[水道施設]],水道[],2,TRUE), IF(NOT(ISBLANK(テーブル63[[#This Row],[許可区分（水道施設）]])),\"D\",\"-\"))","v":"A"}]
[81,"県内","㈱大英電業社","成田市花崎町758-4","小寺　眞澄","0476-22-5111","0476-24-3220",null,null,null,null,"特定",914,null,null,null,null,null,null,null,null,null,null,"一般",681,null,null,{"$f":"IF(NOT(ISBLANK(テーブル63[[#This Row],[土木一式]])),VLOOKUP(テーブル63[[#This Row],[土木一式]],土木[],2,TRUE), IF(NOT(ISBLANK(テーブル63[[#This Row],[許可区分(土木)]])),\"D\",\"-\"))","v":"-"},{"$f":"IF(NOT(ISBLANK(テーブル63[[#This Row],[建築一式]])),VLOOKUP(テーブル63[[#This Row],[建築一式]],建築[],2,TRUE), IF(NOT(ISBLANK(テーブル63[[#This Row],[許可区分（建築）]])),\"D\",\"-\"))","v":"-"},{"$f":"IF(NOT(ISBLANK(テーブル63[[#This Row],[電気]])),VLOOKUP(テーブル63[[#This Row],[電気]],電気[],2,TRUE), IF(NOT(ISBLANK(テーブル63[[#This Row],[許可区分（電気）]])),\"D\",\"-\"))","v":"A"},{"$f":"IF(NOT(ISBLANK(テーブル63[[#This Row],[管]])),VLOOKUP(テーブル63[[#This Row],[管]],管[],2,TRUE), IF(NOT(ISBLANK(テーブル63[[#This Row],[許可区分（管）]])),\"D\",\"-\"))","v":"-"},{"$f":"IF(NOT(ISBLANK(テーブル63[[#This Row],[ほ装]])),VLOOKUP(テーブル63[[#This Row],[ほ装]],ほ装[],2,TRUE), IF(NOT(ISBLANK(テーブル63[[#This Row],[許可区分(ほ装)]])),\"D\",\"-\"))","v":"-"},{"$f":"IF(NOT(ISBLANK(テーブル63[[#This Row],[塗装]])),VLOOKUP(テーブル63[[#This Row],[塗装]],塗装[],2,TRUE), IF(NOT(ISBLANK(テーブル63[[#This Row],[許可区分（塗装）]])),\"D\",\"-\"))","v":"-"},{"$f":"IF(NOT(ISBLANK(テーブル63[[#This Row],[防水]])),VLOOKUP(テーブル63[[#This Row],[防水]],塗装[],2,TRUE), IF(NOT(ISBLANK(テーブル63[[#This Row],[許可区分（防水）]])),\"D\",\"-\"))","v":"-"},{"$f":"IF(NOT(ISBLANK(テーブル63[[#This Row],[機械器具設置]])),VLOOKUP(テーブル63[[#This Row],[機械器具設置]],塗装[],2,TRUE), IF(NOT(ISBLANK(テーブル63[[#This Row],[許可区分（機械器具）]])),\"D\",\"-\"))","v":"-"},{"$f":"IF(NOT(ISBLANK(テーブル63[[#This Row],[電気通信]])),VLOOKUP(テーブル63[[#This Row],[電気通信]],電気[],2,TRUE), IF(NOT(ISBLANK(テーブル63[[#This Row],[許可区分(電気)]])),\"D\",\"-\"))","v":"C"},{"$f":"IF(NOT(ISBLANK(テーブル63[[#This Row],[水道施設]])),VLOOKUP(テーブル63[[#This Row],[水道施設]],水道[],2,TRUE), IF(NOT(ISBLANK(テーブル63[[#This Row],[許可区分（水道施設）]])),\"D\",\"-\"))","v":"-"}]
[82,"県内","若築建設㈱　千葉支店","千葉市中央区新田町4-22","岡村　純","043-242-2245","043-243-3350","特定",1703,"特定",1535,"特定",948,"特定",946,"特定",901,null,null,null,null,null,null,null,null,"特定",1221,{"$f":"IF(NOT(ISBLANK(テーブル63[[#This Row],[土木一式]])),VLOOKUP(テーブル63[[#This Row],[土木一式]],土木[],2,TRUE), IF(NOT(ISBLANK(テーブル63[[#This Row],[許可区分(土木)]])),\"D\",\"-\"))","v":"A"},{"$f":"IF(NOT(ISBLANK(テーブル63[[#This Row],[建築一式]])),VLOOKUP(テーブル63[[#This Row],[建築一式]],建築[],2,TRUE), IF(NOT(ISBLANK(テーブル63[[#This Row],[許可区分（建築）]])),\"D\",\"-\"))","v":"A"},{"$f":"IF(NOT(ISBLANK(テーブル63[[#This Row],[電気]])),VLOOKUP(テーブル63[[#This Row],[電気]],電気[],2,TRUE), IF(NOT(ISBLANK(テーブル63[[#This Row],[許可区分（電気）]])),\"D\",\"-\"))","v":"A"},{"$f":"IF(NOT(ISBLANK(テーブル63[[#This Row],[管]])),VLOOKUP(テーブル63[[#This Row],[管]],管[],2,TRUE), IF(NOT(ISBLANK(テーブル63[[#This Row],[許可区分（管）]])),\"D\",\"-\"))","v":"A"},{"$f":"IF(NOT(ISBLANK(テーブル63[[#This Row],[ほ装]])),VLOOKUP(テーブル63[[#This Row],[ほ装]],ほ装[],2,TRUE), IF(NOT(ISBLANK(テーブル63[[#This Row],[許可区分(ほ装)]])),\"D\",\"-\"))","v":"A"},{"$f":"IF(NOT(ISBLANK(テーブル63[[#This Row],[塗装]])),VLOOKUP(テーブル63[[#This Row],[塗装]],塗装[],2,TRUE), IF(NOT(ISBLANK(テーブル63[[#This Row],[許可区分（塗装）]])),\"D\",\"-\"))","v":"-"},{"$f":"IF(NOT(ISBLANK(テーブル63[[#This Row],[防水]])),VLOOKUP(テーブル63[[#This Row],[防水]],塗装[],2,TRUE), IF(NOT(ISBLANK(テーブル63[[#This Row],[許可区分（防水）]])),\"D\",\"-\"))","v":"-"},{"$f":"IF(NOT(ISBLANK(テーブル63[[#This Row],[機械器具設置]])),VLOOKUP(テーブル63[[#This Row],[機械器具設置]],塗装[],2,TRUE), IF(NOT(ISBLANK(テーブル63[[#This Row],[許可区分（機械器具）]])),\"D\",\"-\"))","v":"-"},{"$f":"IF(NOT(ISBLANK(テーブル63[[#This Row],[電気通信]])),VLOOKUP(テーブル63[[#This Row],[電気通信]],電気[],2,TRUE), IF(NOT(ISBLANK(テーブル63[[#This Row],[許可区分(電気)]])),\"D\",\"-\"))","v":"-"},{"$f":"IF(NOT(ISBLANK(テーブル63[[#This Row],[水道施設]])),VLOOKUP(テーブル63[[#This Row],[水道施設]],水道[],2,TRUE), IF(NOT(ISBLANK(テーブル63[[#This Row],[許可区分（水道施設）]])),\"D\",\"-\"))","v":"A"}]
[83,"県内","㈱ピーエス三菱　千葉営業所","千葉市中央区中央3-9-16","早川　英利","043-222-5477","043-222-8773","特定",1669,"特定",1627,"特定",1083,"特定",1073,"特定",1260,"特定",908,"特定",908,null,null,null,null,"特定",1364,{"$f":"IF(NOT(ISBLANK(テーブル63[[#This Row],[土木一式]])),VLOOKUP(テーブル63[[#This Row],[土木一式]],土木[],2,TRUE), IF(NOT(ISBLANK(テーブル63[[#This Row],[許可区分(土木)]])),\"D\",\"-\"))","v":"A"},{"$f":"IF(NOT(ISBLANK(テーブル63[[#This Row],[建築一式]])),VLOOKUP(テーブル63[[#This Row],[建築一式]],建築[],2,TRUE), IF(NOT(ISBLANK(テーブル63[[#This Row],[許可区分（建築）]])),\"D\",\"-\"))","v":"A"},{"$f":"IF(NOT(ISBLANK(テーブル63[[#This Row],[電気]])),VLOOKUP(テーブル63[[#This Row],[電気]],電気[],2,TRUE), IF(NOT(ISBLANK(テーブル63[[#This Row],[許可区分（電気）]])),\"D\",\"-\"))","v":"A"},{"$f":"IF(NOT(ISBLANK(テーブル63[[#This Row],[管]])),VLOOKUP(テーブル63[[#This Row],[管]],管[],2,TRUE), IF(NOT(ISBLANK(テーブル63[[#This Row],[許可区分（管）]])),\"D\",\"-\"))","v":"A"},{"$f":"IF(NOT(ISBLANK(テーブル63[[#This Row],[ほ装]])),VLOOKUP(テーブル63[[#This Row],[ほ装]],ほ装[],2,TRUE), IF(NOT(ISBLANK(テーブル63[[#This Row],[許可区分(ほ装)]])),\"D\",\"-\"))","v":"A"},{"$f":"IF(NOT(ISBLANK(テーブル63[[#This Row],[塗装]])),VLOOKUP(テーブル63[[#This Row],[塗装]],塗装[],2,TRUE), IF(NOT(ISBLANK(テーブル63[[#This Row],[許可区分（塗装）]])),\"D\",\"-\"))","v":"A"},{"$f":"IF(NOT(ISBLANK(テーブル63[[#This Row],[防水]])),VLOOKUP(テーブル63[[#This Row],[防水]],塗装[],2,TRUE), IF(NOT(ISBLANK(テーブル63[[#This Row],[許可区分（防水）]])),\"D\",\"-\"))","v":"A"},{"$f":"IF(NOT(ISBLANK(テーブル63[[#This Row],[機械器具設置]])),VLOOKUP(テーブル63[[#This Row],[機械器具設置]],塗装[],2,TRUE), IF(NOT(ISBLANK(テーブル63[[#This Row],[許可区分（機械器具）]])),\"D\",\"-\"))","v":"-"},{"$f":"IF(NOT(ISBLANK(テーブル63[[#This Row],[電気通信]])),VLOOKUP(テーブル63[[#This Row],[電気通信]],電気[],2,TRUE), IF(NOT(ISBLANK(テーブル63[[#This Row],[許可区分(電気)]])),\"D\",\"-\"))","v":"-"},{"$f":"IF(NOT(ISBLANK(テーブル63[[#This Row],[水道施設]])),VLOOKUP(テーブル63[[#This Row],[水道施設]],水道[],2,TRUE), IF(NOT(ISBLANK(テーブル63[[#This Row],[許可区分（水道施設）]])),\"D\",\"-\"))","v":"A"}]
[84,"県内","㈱サンエイロテック　東金営業所","東金市台方1583-6","白鳥　文子","0475-53-0260","0475-53-0268","一般",740,null,null,null,null,null,null,"一般",707,"一般",909,null,null,null,null,null,null,null,null,{"$f":"IF(NOT(ISBLANK(テーブル63[[#This Row],[土木一式]])),VLOOKUP(テーブル63[[#This Row],[土木一式]],土木[],2,TRUE), IF(NOT(ISBLANK(テーブル63[[#This Row],[許可区分(土木)]])),\"D\",\"-\"))","v":"B"},{"$f":"IF(NOT(ISBLANK(テーブル63[[#This Row],[建築一式]])),VLOOKUP(テーブル63[[#This Row],[建築一式]],建築[],2,TRUE), IF(NOT(ISBLANK(テーブル63[[#This Row],[許可区分（建築）]])),\"D\",\"-\"))","v":"-"},{"$f":"IF(NOT(ISBLANK(テーブル63[[#This Row],[電気]])),VLOOKUP(テーブル63[[#This Row],[電気]],電気[],2,TRUE), IF(NOT(ISBLANK(テーブル63[[#This Row],[許可区分（電気）]])),\"D\",\"-\"))","v":"-"},{"$f":"IF(NOT(ISBLANK(テーブル63[[#This Row],[管]])),VLOOKUP(テーブル63[[#This Row],[管]],管[],2,TRUE), IF(NOT(ISBLANK(テーブル63[[#This Row],[許可区分（管）]])),\"D\",\"-\"))","v":"-"},{"$f":"IF(NOT(ISBLANK(テーブル63[[#This Row],[ほ装]])),VLOOKUP(テーブル63[[#This Row],[ほ装]],ほ装[],2,TRUE), IF(NOT(ISBLANK(テーブル63[[#This Row],[許可区分(ほ装)]])),\"D\",\"-\"))","v":"A"},{"$f":"IF(NOT(ISBLANK(テーブル63[[#This Row],[塗装]])),VLOOKUP(テーブル63[[#This Row],[塗装]],塗装[],2,TRUE), IF(NOT(ISBLANK(テーブル63[[#This Row],[許可区分（塗装）]])),\"D\",\"-\"))","v":"A"},{"$f":"IF(NOT(ISBLANK(テーブル63[[#This Row],[防水]])),VLOOKUP(テーブル63[[#This Row],[防水]],塗装[],2,TRUE), IF(NOT(ISBLANK(テーブル63[[#This Row],[許可区分（防水）]])),\"D\",\"-\"))","v":"-"},{"$f":"IF(NOT(ISBLANK(テーブル63[[#This Row],[機械器具設置]])),VLOOKUP(テーブル63[[#This Row],[機械器具設置]],塗装[],2,TRUE), IF(NOT(ISBLANK(テーブル63[[#This Row],[許可区分（機械器具）]])),\"D\",\"-\"))","v":"-"},{"$f":"IF(NOT(ISBLANK(テーブル63[[#This Row],[電気通信]])),VLOOKUP(テーブル63[[#This Row],[電気通信]],電気[],2,TRUE), IF(NOT(ISBLANK(テーブル63[[#This Row],[許可区分(電気)]])),\"D\",\"-\"))","v":"-"},{"$f":"IF(NOT(ISBLANK(テーブル63[[#This Row],[水道施設]])),VLOOKUP(テーブル63[[#This Row],[水道施設]],水道[],2,TRUE), IF(NOT(ISBLANK(テーブル63[[#This Row],[許可区分（水道施設）]])),\"D\",\"-\"))","v":"-"}]
[85,"県内","㈱高岡電機店","成田市東和田201","高岡　　公代","0476-22-2728","0476-24-0068",null,null,null,null,"特定",797,"一般",669,null,null,null,null,null,null,null,null,null,null,null,null,{"$f":"IF(NOT(ISBLANK(テーブル63[[#This Row],[土木一式]])),VLOOKUP(テーブル63[[#This Row],[土木一式]],土木[],2,TRUE), IF(NOT(ISBLANK(テーブル63[[#This Row],[許可区分(土木)]])),\"D\",\"-\"))","v":"-"},{"$f":"IF(NOT(ISBLANK(テーブル63[[#This Row],[建築一式]])),VLOOKUP(テーブル63[[#This Row],[建築一式]],建築[],2,TRUE), IF(NOT(ISBLANK(テーブル63[[#This Row],[許可区分（建築）]])),\"D\",\"-\"))","v":"-"},{"$f":"IF(NOT(ISBLANK(テーブル63[[#This Row],[電気]])),VLOOKUP(テーブル63[[#This Row],[電気]],電気[],2,TRUE), IF(NOT(ISBLANK(テーブル63[[#This Row],[許可区分（電気）]])),\"D\",\"-\"))","v":"B"},{"$f":"IF(NOT(ISBLANK(テーブル63[[#This Row],[管]])),VLOOKUP(テーブル63[[#This Row],[管]],管[],2,TRUE), IF(NOT(ISBLANK(テーブル63[[#This Row],[許可区分（管）]])),\"D\",\"-\"))","v":"B"},{"$f":"IF(NOT(ISBLANK(テーブル63[[#This Row],[ほ装]])),VLOOKUP(テーブル63[[#This Row],[ほ装]],ほ装[],2,TRUE), IF(NOT(ISBLANK(テーブル63[[#This Row],[許可区分(ほ装)]])),\"D\",\"-\"))","v":"-"},{"$f":"IF(NOT(ISBLANK(テーブル63[[#This Row],[塗装]])),VLOOKUP(テーブル63[[#This Row],[塗装]],塗装[],2,TRUE), IF(NOT(ISBLANK(テーブル63[[#This Row],[許可区分（塗装）]])),\"D\",\"-\"))","v":"-"},{"$f":"IF(NOT(ISBLANK(テーブル63[[#This Row],[防水]])),VLOOKUP(テーブル63[[#This Row],[防水]],塗装[],2,TRUE), IF(NOT(ISBLANK(テーブル63[[#This Row],[許可区分（防水）]])),\"D\",\"-\"))","v":"-"},{"$f":"IF(NOT(ISBLANK(テーブル63[[#This Row],[機械器具設置]])),VLOOKUP(テーブル63[[#This Row],[機械器具設置]],塗装[],2,TRUE), IF(NOT(ISBLANK(テーブル63[[#This Row],[許可区分（機械器具）]])),\"D\",\"-\"))","v":"-"},{"$f":"IF(NOT(ISBLANK(テーブル63[[#This Row],[電気通信]])),VLOOKUP(テーブル63[[#This Row],[電気通信]],電気[],2,TRUE), IF(NOT(ISBLANK(テーブル63[[#This Row],[許可区分(電気)]])),\"D\",\"-\"))","v":"-"},{"$f":"IF(NOT(ISBLANK(テーブル63[[#This Row],[水道施設]])),VLOOKUP(テーブル63[[#This Row],[水道施設]],水道[],2,TRUE), IF(NOT(ISBLANK(テーブル63[[#This Row],[許可区分（水道施設）]])),\"D\",\"-\"))","v":"-"}]
[86,"県内","あおみ建設㈱　千葉営業所","千葉市中央区祐光3-3-9 ","山﨑　康博","043-227-1391","043-221-0671","特定",1611,null,null,null,null,null,null,"特定",957,null,null,null,null,null,null,null,null,"特定",1201,{"$f":"IF(NOT(ISBLANK(テーブル63[[#This Row],[土木一式]])),VLOOKUP(テーブル63[[#This Row],[土木一式]],土木[],2,TRUE), IF(NOT(ISBLANK(テーブル63[[#This Row],[許可区分(土木)]])),\"D\",\"-\"))","v":"A"},{"$f":"IF(NOT(ISBLANK(テーブル63[[#This Row],[建築一式]])),VLOOKUP(テーブル63[[#This Row],[建築一式]],建築[],2,TRUE), IF(NOT(ISBLANK(テーブル63[[#This Row],[許可区分（建築）]])),\"D\",\"-\"))","v":"-"},{"$f":"IF(NOT(ISBLANK(テーブル63[[#This Row],[電気]])),VLOOKUP(テーブル63[[#This Row],[電気]],電気[],2,TRUE), IF(NOT(ISBLANK(テーブル63[[#This Row],[許可区分（電気）]])),\"D\",\"-\"))","v":"-"},{"$f":"IF(NOT(ISBLANK(テーブル63[[#This Row],[管]])),VLOOKUP(テーブル63[[#This Row],[管]],管[],2,TRUE), IF(NOT(ISBLANK(テーブル63[[#This Row],[許可区分（管）]])),\"D\",\"-\"))","v":"-"},{"$f":"IF(NOT(ISBLANK(テーブル63[[#This Row],[ほ装]])),VLOOKUP(テーブル63[[#This Row],[ほ装]],ほ装[],2,TRUE), IF(NOT(ISBLANK(テーブル63[[#This Row],[許可区分(ほ装)]])),\"D\",\"-\"))","v":"A"},{"$f":"IF(NOT(ISBLANK(テーブル63[[#This Row],[塗装]])),VLOOKUP(テーブル63[[#This Row],[塗装]],塗装[],2,TRUE), IF(NOT(ISBLANK(テーブル63[[#This Row],[許可区分（塗装）]])),\"D\",\"-\"))","v":"-"},{"$f":"IF(NOT(ISBLANK(テーブル63[[#This Row],[防水]])),VLOOKUP(テーブル63[[#This Row],[防水]],塗装[],2,TRUE), IF(NOT(ISBLANK(テーブル63[[#This Row],[許可区分（防水）]])),\"D\",\"-\"))","v":"-"},{"$f":"IF(NOT(ISBLANK(テーブル63[[#This Row],[機械器具設置]])),VLOOKUP(テーブル63[[#This Row],[機械器具設置]],塗装[],2,TRUE), IF(NOT(ISBLANK(テーブル63[[#This Row],[許可区分（機械器具）]])),\"D\",\"-\"))","v":"-"},{"$f":"IF(NOT(ISBLANK(テーブル63[[#This Row],[電気通信]])),VLOOKUP(テーブル63[[#This Row],[電気通信]],電気[],2,TRUE), IF(NOT(ISBLANK(テーブル63[[#This Row],[許可区分(電気)]])),\"D\",\"-\"))","v":"-"},{"$f":"IF(NOT(ISBLANK(テーブル63[[#This Row],[水道施設]])),VLOOKUP(テーブル63[[#This Row],[水道施設]],水道[],2,TRUE), IF(NOT(ISBLANK(テーブル63[[#This Row],[許可区分（水道施設）]])),\"D\",\"-\"))","v":"A"}]
[32,"県外","㈱竹中土木　千葉営業所","千葉市中央区中央港1-16-1","三塚　康","043-244-7295","043-301-7045","特定",1805,null,null,null,null,null,null,"特定",1236,null,null,null,null,null,null,null,null,"特定",1245,{"$f":"IF(NOT(ISBLANK(テーブル63[[#This Row],[土木一式]])),VLOOKUP(テーブル63[[#This Row],[土木一式]],土木[],2,TRUE), IF(NOT(ISBLANK(テーブル63[[#This Row],[許可区分(土木)]])),\"D\",\"-\"))","v":"A"},{"$f":"IF(NOT(ISBLANK(テーブル63[[#This Row],[建築一式]])),VLOOKUP(テーブル63[[#This Row],[建築一式]],建築[],2,TRUE), IF(NOT(ISBLANK(テーブル63[[#This Row],[許可区分（建築）]])),\"D\",\"-\"))","v":"-"},{"$f":"IF(NOT(ISBLANK(テーブル63[[#This Row],[電気]])),VLOOKUP(テーブル63[[#This Row],[電気]],電気[],2,TRUE), IF(NOT(ISBLANK(テーブル63[[#This Row],[許可区分（電気）]])),\"D\",\"-\"))","v":"-"},{"$f":"IF(NOT(ISBLANK(テーブル63[[#This Row],[管]])),VLOOKUP(テーブル63[[#This Row],[管]],管[],2,TRUE), IF(NOT(ISBLANK(テーブル63[[#This Row],[許可区分（管）]])),\"D\",\"-\"))","v":"-"},{"$f":"IF(NOT(ISBLANK(テーブル63[[#This Row],[ほ装]])),VLOOKUP(テーブル63[[#This Row],[ほ装]],ほ装[],2,TRUE), IF(NOT(ISBLANK(テーブル63[[#This Row],[許可区分(ほ装)]])),\"D\",\"-\"))","v":"A"},{"$f":"IF(NOT(ISBLANK(テーブル63[[#This Row],[塗装]])),VLOOKUP(テーブル63[[#This Row],[塗装]],塗装[],2,TRUE), IF(NOT(ISBLANK(テーブル63[[#This Row],[許可区分（塗装）]])),\"D\",\"-\"))","v":"-"},{"$f":"IF(NOT(ISBLANK(テーブル63[[#This Row],[防水]])),VLOOKUP(テーブル63[[#This Row],[防水]],塗装[],2,TRUE), IF(NOT(ISBLANK(テーブル63[[#This Row],[許可区分（防水）]])),\"D\",\"-\"))","v":"-"},{"$f":"IF(NOT(ISBLANK(テーブル63[[#This Row],[機械器具設置]])),VLOOKUP(テーブル63[[#This Row],[機械器具設置]],塗装[],2,TRUE), IF(NOT(ISBLANK(テーブル63[[#This Row],[許可区分（機械器具）]])),\"D\",\"-\"))","v":"-"},{"$f":"IF(NOT(ISBLANK(テーブル63[[#This Row],[電気通信]])),VLOOKUP(テーブル63[[#This Row],[電気通信]],電気[],2,TRUE), IF(NOT(ISBLANK(テーブル63[[#This Row],[許可区分(電気)]])),\"D\",\"-\"))","v":"-"},{"$f":"IF(NOT(ISBLANK(テーブル63[[#This Row],[水道施設]])),VLOOKUP(テーブル63[[#This Row],[水道施設]],水道[],2,TRUE), IF(NOT(ISBLANK(テーブル63[[#This Row],[許可区分（水道施設）]])),\"D\",\"-\"))","v":"A"}]
[88,"県内","遠藤建設㈱","旭市後草75","伊藤　幸夫","0479-55-5171","0479-55-4808","特定",992,"一般",679,null,null,"一般",679,"特定",848,null,null,null,null,null,null,null,null,"特定",792,{"$f":"IF(NOT(ISBLANK(テーブル63[[#This Row],[土木一式]])),VLOOKUP(テーブル63[[#This Row],[土木一式]],土木[],2,TRUE), IF(NOT(ISBLANK(テーブル63[[#This Row],[許可区分(土木)]])),\"D\",\"-\"))","v":"A"},{"$f":"IF(NOT(ISBLANK(テーブル63[[#This Row],[建築一式]])),VLOOKUP(テーブル63[[#This Row],[建築一式]],建築[],2,TRUE), IF(NOT(ISBLANK(テーブル63[[#This Row],[許可区分（建築）]])),\"D\",\"-\"))","v":"C"},{"$f":"IF(NOT(ISBLANK(テーブル63[[#This Row],[電気]])),VLOOKUP(テーブル63[[#This Row],[電気]],電気[],2,TRUE), IF(NOT(ISBLANK(テーブル63[[#This Row],[許可区分（電気）]])),\"D\",\"-\"))","v":"-"},{"$f":"IF(NOT(ISBLANK(テーブル63[[#This Row],[管]])),VLOOKUP(テーブル63[[#This Row],[管]],管[],2,TRUE), IF(NOT(ISBLANK(テーブル63[[#This Row],[許可区分（管）]])),\"D\",\"-\"))","v":"B"},{"$f":"IF(NOT(ISBLANK(テーブル63[[#This Row],[ほ装]])),VLOOKUP(テーブル63[[#This Row],[ほ装]],ほ装[],2,TRUE), IF(NOT(ISBLANK(テーブル63[[#This Row],[許可区分(ほ装)]])),\"D\",\"-\"))","v":"A"},{"$f":"IF(NOT(ISBLANK(テーブル63[[#This Row],[塗装]])),VLOOKUP(テーブル63[[#This Row],[塗装]],塗装[],2,TRUE), IF(NOT(ISBLANK(テーブル63[[#This Row],[許可区分（塗装）]])),\"D\",\"-\"))","v":"-"},{"$f":"IF(NOT(ISBLANK(テーブル63[[#This Row],[防水]])),VLOOKUP(テーブル63[[#This Row],[防水]],塗装[],2,TRUE), IF(NOT(ISBLANK(テーブル63[[#This Row],[許可区分（防水）]])),\"D\",\"-\"))","v":"-"},{"$f":"IF(NOT(ISBLANK(テーブル63[[#This Row],[機械器具設置]])),VLOOKUP(テーブル63[[#This Row],[機械器具設置]],塗装[],2,TRUE), IF(NOT(ISBLANK(テーブル63[[#This Row],[許可区分（機械器具）]])),\"D\",\"-\"))","v":"-"},{"$f":"IF(NOT(ISBLANK(テーブル63[[#This Row],[電気通信]])),VLOOKUP(テーブル63[[#This Row],[電気通信]],電気[],2,TRUE), IF(NOT(ISBLANK(テーブル63[[#This Row],[許可区分(電気)]])),\"D\",\"-\"))","v":"-"},{"$f":"IF(NOT(ISBLANK(テーブル63[[#This Row],[水道施設]])),VLOOKUP(テーブル63[[#This Row],[水道施設]],水道[],2,TRUE), IF(NOT(ISBLANK(テーブル63[[#This Row],[許可区分（水道施設）]])),\"D\",\"-\"))","v":"B"}]
[89,"県内","大谷建設工業㈱","山武郡横芝光町横芝995-111","鈴木　孝","0479-80-1377","0479-80-1378","一般",682,"一般",688,null,null,null,null,"一般",591,null,null,null,null,null,null,null,null,"一般",564,{"$f":"IF(NOT(ISBLANK(テーブル63[[#This Row],[土木一式]])),VLOOKUP(テーブル63[[#This Row],[土木一式]],土木[],2,TRUE), IF(NOT(ISBLANK(テーブル63[[#This Row],[許可区分(土木)]])),\"D\",\"-\"))","v":"B"},{"$f":"IF(NOT(ISBLANK(テーブル63[[#This Row],[建築一式]])),VLOOKUP(テーブル63[[#This Row],[建築一式]],建築[],2,TRUE), IF(NOT(ISBLANK(テーブル63[[#This Row],[許可区分（建築）]])),\"D\",\"-\"))","v":"C"},{"$f":"IF(NOT(ISBLANK(テーブル63[[#This Row],[電気]])),VLOOKUP(テーブル63[[#This Row],[電気]],電気[],2,TRUE), IF(NOT(ISBLANK(テーブル63[[#This Row],[許可区分（電気）]])),\"D\",\"-\"))","v":"-"},{"$f":"IF(NOT(ISBLANK(テーブル63[[#This Row],[管]])),VLOOKUP(テーブル63[[#This Row],[管]],管[],2,TRUE), IF(NOT(ISBLANK(テーブル63[[#This Row],[許可区分（管）]])),\"D\",\"-\"))","v":"-"},{"$f":"IF(NOT(ISBLANK(テーブル63[[#This Row],[ほ装]])),VLOOKUP(テーブル63[[#This Row],[ほ装]],ほ装[],2,TRUE), IF(NOT(ISBLANK(テーブル63[[#This Row],[許可区分(ほ装)]])),\"D\",\"-\"))","v":"C"},{"$f":"IF(NOT(ISBLANK(テーブル63[[#This Row],[塗装]])),VLOOKUP(テーブル63[[#This Row],[塗装]],塗装[],2,TRUE), IF(NOT(ISBLANK(テーブル63[[#This Row],[許可区分（塗装）]])),\"D\",\"-\"))","v":"-"},{"$f":"IF(NOT(ISBLANK(テーブル63[[#This Row],[防水]])),VLOOKUP(テーブル63[[#This Row],[防水]],塗装[],2,TRUE), IF(NOT(ISBLANK(テーブル63[[#This Row],[許可区分（防水）]])),\"D\",\"-\"))","v":"-"},{"$f":"IF(NOT(ISBLANK(テーブル63[[#This Row],[機械器具設置]])),VLOOKUP(テーブル63[[#This Row],[機械器具設置]],塗装[],2,TRUE), IF(NOT(ISBLANK(テーブル63[[#This Row],[許可区分（機械器具）]])),\"D\",\"-\"))","v":"-"},{"$f":"IF(NOT(ISBLANK(テーブル63[[#This Row],[電気通信]])),VLOOKUP(テーブル63[[#This Row],[電気通信]],電気[],2,TRUE), IF(NOT(ISBLANK(テーブル63[[#This Row],[許可区分(電気)]])),\"D\",\"-\"))","v":"-"},{"$f":"IF(NOT(ISBLANK(テーブル63[[#This Row],[水道施設]])),VLOOKUP(テーブル63[[#This Row],[水道施設]],水道[],2,TRUE), IF(NOT(ISBLANK(テーブル63[[#This Row],[許可区分（水道施設）]])),\"D\",\"-\"))","v":"D"}]
[90,"県内","上松工業㈱","千葉市花見川区幕張町1-7675-40","歳田　文彦","043-271-8150","043-273-3866",null,null,null,null,null,null,null,null,null,null,null,null,"一般",839,null,null,null,null,null,null,{"$f":"IF(NOT(ISBLANK(テーブル63[[#This Row],[土木一式]])),VLOOKUP(テーブル63[[#This Row],[土木一式]],土木[],2,TRUE), IF(NOT(ISBLANK(テーブル63[[#This Row],[許可区分(土木)]])),\"D\",\"-\"))","v":"-"},{"$f":"IF(NOT(ISBLANK(テーブル63[[#This Row],[建築一式]])),VLOOKUP(テーブル63[[#This Row],[建築一式]],建築[],2,TRUE), IF(NOT(ISBLANK(テーブル63[[#This Row],[許可区分（建築）]])),\"D\",\"-\"))","v":"-"},{"$f":"IF(NOT(ISBLANK(テーブル63[[#This Row],[電気]])),VLOOKUP(テーブル63[[#This Row],[電気]],電気[],2,TRUE), IF(NOT(ISBLANK(テーブル63[[#This Row],[許可区分（電気）]])),\"D\",\"-\"))","v":"-"},{"$f":"IF(NOT(ISBLANK(テーブル63[[#This Row],[管]])),VLOOKUP(テーブル63[[#This Row],[管]],管[],2,TRUE), IF(NOT(ISBLANK(テーブル63[[#This Row],[許可区分（管）]])),\"D\",\"-\"))","v":"-"},{"$f":"IF(NOT(ISBLANK(テーブル63[[#This Row],[ほ装]])),VLOOKUP(テーブル63[[#This Row],[ほ装]],ほ装[],2,TRUE), IF(NOT(ISBLANK(テーブル63[[#This Row],[許可区分(ほ装)]])),\"D\",\"-\"))","v":"-"},{"$f":"IF(NOT(ISBLANK(テーブル63[[#This Row],[塗装]])),VLOOKUP(テーブル63[[#This Row],[塗装]],塗装[],2,TRUE), IF(NOT(ISBLANK(テーブル63[[#This Row],[許可区分（塗装）]])),\"D\",\"-\"))","v":"-"},{"$f":"IF(NOT(ISBLANK(テーブル63[[#This Row],[防水]])),VLOOKUP(テーブル63[[#This Row],[防水]],塗装[],2,TRUE), IF(NOT(ISBLANK(テーブル63[[#This Row],[許可区分（防水）]])),\"D\",\"-\"))","v":"A"},{"$f":"IF(NOT(ISBLANK(テーブル63[[#This Row],[機械器具設置]])),VLOOKUP(テーブル63[[#This Row],[機械器具設置]],塗装[],2,TRUE), IF(NOT(ISBLANK(テーブル63[[#This Row],[許可区分（機械器具）]])),\"D\",\"-\"))","v":"-"},{"$f":"IF(NOT(ISBLANK(テーブル63[[#This Row],[電気通信]])),VLOOKUP(テーブル63[[#This Row],[電気通信]],電気[],2,TRUE), IF(NOT(ISBLANK(テーブル63[[#This Row],[許可区分(電気)]])),\"D\",\"-\"))","v":"-"},{"$f":"IF(NOT(ISBLANK(テーブル63[[#This Row],[水道施設]])),VLOOKUP(テーブル63[[#This Row],[水道施設]],水道[],2,TRUE), IF(NOT(ISBLANK(テーブル63[[#This Row],[許可区分（水道施設）]])),\"D\",\"-\"))","v":"-"}]
[91,"県内","㈱ナカボーテック　東関東支店","市原市五井金杉2-2-2","坂屋　好彦","0436-23-4711","0436-23-4716","特定",1184,null,null,"特定",1300,null,null,null,null,"特定",1049,null,null,null,null,null,null,null,null,{"$f":"IF(NOT(ISBLANK(テーブル63[[#This Row],[土木一式]])),VLOOKUP(テーブル63[[#This Row],[土木一式]],土木[],2,TRUE), IF(NOT(ISBLANK(テーブル63[[#This Row],[許可区分(土木)]])),\"D\",\"-\"))","v":"A"},{"$f":"IF(NOT(ISBLANK(テーブル63[[#This Row],[建築一式]])),VLOOKUP(テーブル63[[#This Row],[建築一式]],建築[],2,TRUE), IF(NOT(ISBLANK(テーブル63[[#This Row],[許可区分（建築）]])),\"D\",\"-\"))","v":"-"},{"$f":"IF(NOT(ISBLANK(テーブル63[[#This Row],[電気]])),VLOOKUP(テーブル63[[#This Row],[電気]],電気[],2,TRUE), IF(NOT(ISBLANK(テーブル63[[#This Row],[許可区分（電気）]])),\"D\",\"-\"))","v":"A"},{"$f":"IF(NOT(ISBLANK(テーブル63[[#This Row],[管]])),VLOOKUP(テーブル63[[#This Row],[管]],管[],2,TRUE), IF(NOT(ISBLANK(テーブル63[[#This Row],[許可区分（管）]])),\"D\",\"-\"))","v":"-"},{"$f":"IF(NOT(ISBLANK(テーブル63[[#This Row],[ほ装]])),VLOOKUP(テーブル63[[#This Row],[ほ装]],ほ装[],2,TRUE), IF(NOT(ISBLANK(テーブル63[[#This Row],[許可区分(ほ装)]])),\"D\",\"-\"))","v":"-"},{"$f":"IF(NOT(ISBLANK(テーブル63[[#This Row],[塗装]])),VLOOKUP(テーブル63[[#This Row],[塗装]],塗装[],2,TRUE), IF(NOT(ISBLANK(テーブル63[[#This Row],[許可区分（塗装）]])),\"D\",\"-\"))","v":"A"},{"$f":"IF(NOT(ISBLANK(テーブル63[[#This Row],[防水]])),VLOOKUP(テーブル63[[#This Row],[防水]],塗装[],2,TRUE), IF(NOT(ISBLANK(テーブル63[[#This Row],[許可区分（防水）]])),\"D\",\"-\"))","v":"-"},{"$f":"IF(NOT(ISBLANK(テーブル63[[#This Row],[機械器具設置]])),VLOOKUP(テーブル63[[#This Row],[機械器具設置]],塗装[],2,TRUE), IF(NOT(ISBLANK(テーブル63[[#This Row],[許可区分（機械器具）]])),\"D\",\"-\"))","v":"-"},{"$f":"IF(NOT(ISBLANK(テーブル63[[#This Row],[電気通信]])),VLOOKUP(テーブル63[[#This Row],[電気通信]],電気[],2,TRUE), IF(NOT(ISBLANK(テーブル63[[#This Row],[許可区分(電気)]])),\"D\",\"-\"))","v":"-"},{"$f":"IF(NOT(ISBLANK(テーブル63[[#This Row],[水道施設]])),VLOOKUP(テーブル63[[#This Row],[水道施設]],水道[],2,TRUE), IF(NOT(ISBLANK(テーブル63[[#This Row],[許可区分（水道施設）]])),\"D\",\"-\"))","v":"-"}]
[92,"県内","昭和塗装㈱","市川市八幡3-15-13","荒金　由紀子","047-324-5589","047-324-2115",null,null,null,null,null,null,null,null,null,null,"特定",896,"特定",730,null,null,null,null,null,null,{"$f":"IF(NOT(ISBLANK(テーブル63[[#This Row],[土木一式]])),VLOOKUP(テーブル63[[#This Row],[土木一式]],土木[],2,TRUE), IF(NOT(ISBLANK(テーブル63[[#This Row],[許可区分(土木)]])),\"D\",\"-\"))","v":"-"},{"$f":"IF(NOT(ISBLANK(テーブル63[[#This Row],[建築一式]])),VLOOKUP(テーブル63[[#This Row],[建築一式]],建築[],2,TRUE), IF(NOT(ISBLANK(テーブル63[[#This Row],[許可区分（建築）]])),\"D\",\"-\"))","v":"-"},{"$f":"IF(NOT(ISBLANK(テーブル63[[#This Row],[電気]])),VLOOKUP(テーブル63[[#This Row],[電気]],電気[],2,TRUE), IF(NOT(ISBLANK(テーブル63[[#This Row],[許可区分（電気）]])),\"D\",\"-\"))","v":"-"},{"$f":"IF(NOT(ISBLANK(テーブル63[[#This Row],[管]])),VLOOKUP(テーブル63[[#This Row],[管]],管[],2,TRUE), IF(NOT(ISBLANK(テーブル63[[#This Row],[許可区分（管）]])),\"D\",\"-\"))","v":"-"},{"$f":"IF(NOT(ISBLANK(テーブル63[[#This Row],[ほ装]])),VLOOKUP(テーブル63[[#This Row],[ほ装]],ほ装[],2,TRUE), IF(NOT(ISBLANK(テーブル63[[#This Row],[許可区分(ほ装)]])),\"D\",\"-\"))","v":"-"},{"$f":"IF(NOT(ISBLANK(テーブル63[[#This Row],[塗装]])),VLOOKUP(テーブル63[[#This Row],[塗装]],塗装[],2,TRUE), IF(NOT(ISBLANK(テーブル63[[#This Row],[許可区分（塗装）]])),\"D\",\"-\"))","v":"A"},{"$f":"IF(NOT(ISBLANK(テーブル63[[#This Row],[防水]])),VLOOKUP(テーブル63[[#This Row],[防水]],塗装[],2,TRUE), IF(NOT(ISBLANK(テーブル63[[#This Row],[許可区分（防水）]])),\"D\",\"-\"))","v":"B"},{"$f":"IF(NOT(ISBLANK(テーブル63[[#This Row],[機械器具設置]])),VLOOKUP(テーブル63[[#This Row],[機械器具設置]],塗装[],2,TRUE), IF(NOT(ISBLANK(テーブル63[[#This Row],[許可区分（機械器具）]])),\"D\",\"-\"))","v":"-"},{"$f":"IF(NOT(ISBLANK(テーブル63[[#This Row],[電気通信]])),VLOOKUP(テーブル63[[#This Row],[電気通信]],電気[],2,TRUE), IF(NOT(ISBLANK(テーブル63[[#This Row],[許可区分(電気)]])),\"D\",\"-\"))","v":"-"},{"$f":"IF(NOT(ISBLANK(テーブル63[[#This Row],[水道施設]])),VLOOKUP(テーブル63[[#This Row],[水道施設]],水道[],2,TRUE), IF(NOT(ISBLANK(テーブル63[[#This Row],[許可区分（水道施設）]])),\"D\",\"-\"))","v":"-"}]
[93,"県内","小峯電業㈱","千葉市若葉区殿台町127-1","小峯　健一","043-290-0038","043-290-0039",null,null,null,null,"特定",997,null,null,null,null,null,null,null,null,null,null,null,null,null,null,{"$f":"IF(NOT(ISBLANK(テーブル63[[#This Row],[土木一式]])),VLOOKUP(テーブル63[[#This Row],[土木一式]],土木[],2,TRUE), IF(NOT(ISBLANK(テーブル63[[#This Row],[許可区分(土木)]])),\"D\",\"-\"))","v":"-"},{"$f":"IF(NOT(ISBLANK(テーブル63[[#This Row],[建築一式]])),VLOOKUP(テーブル63[[#This Row],[建築一式]],建築[],2,TRUE), IF(NOT(ISBLANK(テーブル63[[#This Row],[許可区分（建築）]])),\"D\",\"-\"))","v":"-"},{"$f":"IF(NOT(ISBLANK(テーブル63[[#This Row],[電気]])),VLOOKUP(テーブル63[[#This Row],[電気]],電気[],2,TRUE), IF(NOT(ISBLANK(テーブル63[[#This Row],[許可区分（電気）]])),\"D\",\"-\"))","v":"A"},{"$f":"IF(NOT(ISBLANK(テーブル63[[#This Row],[管]])),VLOOKUP(テーブル63[[#This Row],[管]],管[],2,TRUE), IF(NOT(ISBLANK(テーブル63[[#This Row],[許可区分（管）]])),\"D\",\"-\"))","v":"-"},{"$f":"IF(NOT(ISBLANK(テーブル63[[#This Row],[ほ装]])),VLOOKUP(テーブル63[[#This Row],[ほ装]],ほ装[],2,TRUE), IF(NOT(ISBLANK(テーブル63[[#This Row],[許可区分(ほ装)]])),\"D\",\"-\"))","v":"-"},{"$f":"IF(NOT(ISBLANK(テーブル63[[#This Row],[塗装]])),VLOOKUP(テーブル63[[#This Row],[塗装]],塗装[],2,TRUE), IF(NOT(ISBLANK(テーブル63[[#This Row],[許可区分（塗装）]])),\"D\",\"-\"))","v":"-"},{"$f":"IF(NOT(ISBLANK(テーブル63[[#This Row],[防水]])),VLOOKUP(テーブル63[[#This Row],[防水]],塗装[],2,TRUE), IF(NOT(ISBLANK(テーブル63[[#This Row],[許可区分（防水）]])),\"D\",\"-\"))","v":"-"},{"$f":"IF(NOT(ISBLANK(テーブル63[[#This Row],[機械器具設置]])),VLOOKUP(テーブル63[[#This Row],[機械器具設置]],塗装[],2,TRUE), IF(NOT(ISBLANK(テーブル63[[#This Row],[許可区分（機械器具）]])),\"D\",\"-\"))","v":"-"},{"$f":"IF(NOT(ISBLANK(テーブル63[[#This Row],[電気通信]])),VLOOKUP(テーブル63[[#This Row],[電気通信]],電気[],2,TRUE), IF(NOT(ISBLANK(テーブル63[[#This Row],[許可区分(電気)]])),\"D\",\"-\"))","v":"-"},{"$f":"IF(NOT(ISBLANK(テーブル63[[#This Row],[水道施設]])),VLOOKUP(テーブル63[[#This Row],[水道施設]],水道[],2,TRUE), IF(NOT(ISBLANK(テーブル63[[#This Row],[許可区分（水道施設）]])),\"D\",\"-\"))","v":"-"}]
[94,"県内","北総電機産業㈱","船橋市本郷町720","椎名　教泰","047-335-1331","047-335-2800",null,null,null,null,"特定",979,"特定",805,null,null,null,null,null,null,null,null,null,null,null,null,{"$f":"IF(NOT(ISBLANK(テーブル63[[#This Row],[土木一式]])),VLOOKUP(テーブル63[[#This Row],[土木一式]],土木[],2,TRUE), IF(NOT(ISBLANK(テーブル63[[#This Row],[許可区分(土木)]])),\"D\",\"-\"))","v":"-"},{"$f":"IF(NOT(ISBLANK(テーブル63[[#This Row],[建築一式]])),VLOOKUP(テーブル63[[#This Row],[建築一式]],建築[],2,TRUE), IF(NOT(ISBLANK(テーブル63[[#This Row],[許可区分（建築）]])),\"D\",\"-\"))","v":"-"},{"$f":"IF(NOT(ISBLANK(テーブル63[[#This Row],[電気]])),VLOOKUP(テーブル63[[#This Row],[電気]],電気[],2,TRUE), IF(NOT(ISBLANK(テーブル63[[#This Row],[許可区分（電気）]])),\"D\",\"-\"))","v":"A"},{"$f":"IF(NOT(ISBLANK(テーブル63[[#This Row],[管]])),VLOOKUP(テーブル63[[#This Row],[管]],管[],2,TRUE), IF(NOT(ISBLANK(テーブル63[[#This Row],[許可区分（管）]])),\"D\",\"-\"))","v":"A"},{"$f":"IF(NOT(ISBLANK(テーブル63[[#This Row],[ほ装]])),VLOOKUP(テーブル63[[#This Row],[ほ装]],ほ装[],2,TRUE), IF(NOT(ISBLANK(テーブル63[[#This Row],[許可区分(ほ装)]])),\"D\",\"-\"))","v":"-"},{"$f":"IF(NOT(ISBLANK(テーブル63[[#This Row],[塗装]])),VLOOKUP(テーブル63[[#This Row],[塗装]],塗装[],2,TRUE), IF(NOT(ISBLANK(テーブル63[[#This Row],[許可区分（塗装）]])),\"D\",\"-\"))","v":"-"},{"$f":"IF(NOT(ISBLANK(テーブル63[[#This Row],[防水]])),VLOOKUP(テーブル63[[#This Row],[防水]],塗装[],2,TRUE), IF(NOT(ISBLANK(テーブル63[[#This Row],[許可区分（防水）]])),\"D\",\"-\"))","v":"-"},{"$f":"IF(NOT(ISBLANK(テーブル63[[#This Row],[機械器具設置]])),VLOOKUP(テーブル63[[#This Row],[機械器具設置]],塗装[],2,TRUE), IF(NOT(ISBLANK(テーブル63[[#This Row],[許可区分（機械器具）]])),\"D\",\"-\"))","v":"-"},{"$f":"IF(NOT(ISBLANK(テーブル63[[#This Row],[電気通信]])),VLOOKUP(テーブル63[[#This Row],[電気通信]],電気[],2,TRUE), IF(NOT(ISBLANK(テーブル63[[#This Row],[許可区分(電気)]])),\"D\",\"-\"))","v":"-"},{"$f":"IF(NOT(ISBLANK(テーブル63[[#This Row],[水道施設]])),VLOOKUP(テーブル63[[#This Row],[水道施設]],水道[],2,TRUE), IF(NOT(ISBLANK(テーブル63[[#This Row],[許可区分（水道施設）]])),\"D\",\"-\"))","v":"-"}]
[95,"県内","㈱ナカムラ","山武郡横芝光町横芝2073-8","堺　義明","0479-82-0208","0479-82-4823",null,null,null,null,null,null,null,null,null,null,"一般",758,"一般",708,null,null,null,null,null,null,{"$f":"IF(NOT(ISBLANK(テーブル63[[#This Row],[土木一式]])),VLOOKUP(テーブル63[[#This Row],[土木一式]],土木[],2,TRUE), IF(NOT(ISBLANK(テーブル63[[#This Row],[許可区分(土木)]])),\"D\",\"-\"))","v":"-"},{"$f":"IF(NOT(ISBLANK(テーブル63[[#This Row],[建築一式]])),VLOOKUP(テーブル63[[#This Row],[建築一式]],建築[],2,TRUE), IF(NOT(ISBLANK(テーブル63[[#This Row],[許可区分（建築）]])),\"D\",\"-\"))","v":"-"},{"$f":"IF(NOT(ISBLANK(テーブル63[[#This Row],[電気]])),VLOOKUP(テーブル63[[#This Row],[電気]],電気[],2,TRUE), IF(NOT(ISBLANK(テーブル63[[#This Row],[許可区分（電気）]])),\"D\",\"-\"))","v":"-"},{"$f":"IF(NOT(ISBLANK(テーブル63[[#This Row],[管]])),VLOOKUP(テーブル63[[#This Row],[管]],管[],2,TRUE), IF(NOT(ISBLANK(テーブル63[[#This Row],[許可区分（管）]])),\"D\",\"-\"))","v":"-"},{"$f":"IF(NOT(ISBLANK(テーブル63[[#This Row],[ほ装]])),VLOOKUP(テーブル63[[#This Row],[ほ装]],ほ装[],2,TRUE), IF(NOT(ISBLANK(テーブル63[[#This Row],[許可区分(ほ装)]])),\"D\",\"-\"))","v":"-"},{"$f":"IF(NOT(ISBLANK(テーブル63[[#This Row],[塗装]])),VLOOKUP(テーブル63[[#This Row],[塗装]],塗装[],2,TRUE), IF(NOT(ISBLANK(テーブル63[[#This Row],[許可区分（塗装）]])),\"D\",\"-\"))","v":"B"},{"$f":"IF(NOT(ISBLANK(テーブル63[[#This Row],[防水]])),VLOOKUP(テーブル63[[#This Row],[防水]],塗装[],2,TRUE), IF(NOT(ISBLANK(テーブル63[[#This Row],[許可区分（防水）]])),\"D\",\"-\"))","v":"B"},{"$f":"IF(NOT(ISBLANK(テーブル63[[#This Row],[機械器具設置]])),VLOOKUP(テーブル63[[#This Row],[機械器具設置]],塗装[],2,TRUE), IF(NOT(ISBLANK(テーブル63[[#This Row],[許可区分（機械器具）]])),\"D\",\"-\"))","v":"-"},{"$f":"IF(NOT(ISBLANK(テーブル63[[#This Row],[電気通信]])),VLOOKUP(テーブル63[[#This Row],[電気通信]],電気[],2,TRUE), IF(NOT(ISBLANK(テーブル63[[#This Row],[許可区分(電気)]])),\"D\",\"-\"))","v":"-"},{"$f":"IF(NOT(ISBLANK(テーブル63[[#This Row],[水道施設]])),VLOOKUP(テーブル63[[#This Row],[水道施設]],水道[],2,TRUE), IF(NOT(ISBLANK(テーブル63[[#This Row],[許可区分（水道施設）]])),\"D\",\"-\"))","v":"-"}]
[96,"県内","NECネッツエスアイ㈱　千葉営業所","千葉市美浜区中瀬2-6-1（WBGマリブウエスト29階）","村上　新二","043-297-8700","043-297-8686",null,null,null,null,"特定",1574,null,null,null,null,null,null,null,null,null,null,"特定",1719,null,null,{"$f":"IF(NOT(ISBLANK(テーブル63[[#This Row],[土木一式]])),VLOOKUP(テーブル63[[#This Row],[土木一式]],土木[],2,TRUE), IF(NOT(ISBLANK(テーブル63[[#This Row],[許可区分(土木)]])),\"D\",\"-\"))","v":"-"},{"$f":"IF(NOT(ISBLANK(テーブル63[[#This Row],[建築一式]])),VLOOKUP(テーブル63[[#This Row],[建築一式]],建築[],2,TRUE), IF(NOT(ISBLANK(テーブル63[[#This Row],[許可区分（建築）]])),\"D\",\"-\"))","v":"-"},{"$f":"IF(NOT(ISBLANK(テーブル63[[#This Row],[電気]])),VLOOKUP(テーブル63[[#This Row],[電気]],電気[],2,TRUE), IF(NOT(ISBLANK(テーブル63[[#This Row],[許可区分（電気）]])),\"D\",\"-\"))","v":"A"},{"$f":"IF(NOT(ISBLANK(テーブル63[[#This Row],[管]])),VLOOKUP(テーブル63[[#This Row],[管]],管[],2,TRUE), IF(NOT(ISBLANK(テーブル63[[#This Row],[許可区分（管）]])),\"D\",\"-\"))","v":"-"},{"$f":"IF(NOT(ISBLANK(テーブル63[[#This Row],[ほ装]])),VLOOKUP(テーブル63[[#This Row],[ほ装]],ほ装[],2,TRUE), IF(NOT(ISBLANK(テーブル63[[#This Row],[許可区分(ほ装)]])),\"D\",\"-\"))","v":"-"},{"$f":"IF(NOT(ISBLANK(テーブル63[[#This Row],[塗装]])),VLOOKUP(テーブル63[[#This Row],[塗装]],塗装[],2,TRUE), IF(NOT(ISBLANK(テーブル63[[#This Row],[許可区分（塗装）]])),\"D\",\"-\"))","v":"-"},{"$f":"IF(NOT(ISBLANK(テーブル63[[#This Row],[防水]])),VLOOKUP(テーブル63[[#This Row],[防水]],塗装[],2,TRUE), IF(NOT(ISBLANK(テーブル63[[#This Row],[許可区分（防水）]])),\"D\",\"-\"))","v":"-"},{"$f":"IF(NOT(ISBLANK(テーブル63[[#This Row],[機械器具設置]])),VLOOKUP(テーブル63[[#This Row],[機械器具設置]],塗装[],2,TRUE), IF(NOT(ISBLANK(テーブル63[[#This Row],[許可区分（機械器具）]])),\"D\",\"-\"))","v":"-"},{"$f":"IF(NOT(ISBLANK(テーブル63[[#This Row],[電気通信]])),VLOOKUP(テーブル63[[#This Row],[電気通信]],電気[],2,TRUE), IF(NOT(ISBLANK(テーブル63[[#This Row],[許可区分(電気)]])),\"D\",\"-\"))","v":"A"},{"$f":"IF(NOT(ISBLANK(テーブル63[[#This Row],[水道施設]])),VLOOKUP(テーブル63[[#This Row],[水道施設]],水道[],2,TRUE), IF(NOT(ISBLANK(テーブル63[[#This Row],[許可区分（水道施設）]])),\"D\",\"-\"))","v":"-"}]
[97,"県内","フィデスアルス㈱","大網白里市木崎127","細矢　充","0475-72-1160","0475-72-1175",null,null,null,null,"特定",832,null,null,null,null,null,null,null,null,null,null,null,null,null,null,{"$f":"IF(NOT(ISBLANK(テーブル63[[#This Row],[土木一式]])),VLOOKUP(テーブル63[[#This Row],[土木一式]],土木[],2,TRUE), IF(NOT(ISBLANK(テーブル63[[#This Row],[許可区分(土木)]])),\"D\",\"-\"))","v":"-"},{"$f":"IF(NOT(ISBLANK(テーブル63[[#This Row],[建築一式]])),VLOOKUP(テーブル63[[#This Row],[建築一式]],建築[],2,TRUE), IF(NOT(ISBLANK(テーブル63[[#This Row],[許可区分（建築）]])),\"D\",\"-\"))","v":"-"},{"$f":"IF(NOT(ISBLANK(テーブル63[[#This Row],[電気]])),VLOOKUP(テーブル63[[#This Row],[電気]],電気[],2,TRUE), IF(NOT(ISBLANK(テーブル63[[#This Row],[許可区分（電気）]])),\"D\",\"-\"))","v":"A"},{"$f":"IF(NOT(ISBLANK(テーブル63[[#This Row],[管]])),VLOOKUP(テーブル63[[#This Row],[管]],管[],2,TRUE), IF(NOT(ISBLANK(テーブル63[[#This Row],[許可区分（管）]])),\"D\",\"-\"))","v":"-"},{"$f":"IF(NOT(ISBLANK(テーブル63[[#This Row],[ほ装]])),VLOOKUP(テーブル63[[#This Row],[ほ装]],ほ装[],2,TRUE), IF(NOT(ISBLANK(テーブル63[[#This Row],[許可区分(ほ装)]])),\"D\",\"-\"))","v":"-"},{"$f":"IF(NOT(ISBLANK(テーブル63[[#This Row],[塗装]])),VLOOKUP(テーブル63[[#This Row],[塗装]],塗装[],2,TRUE), IF(NOT(ISBLANK(テーブル63[[#This Row],[許可区分（塗装）]])),\"D\",\"-\"))","v":"-"},{"$f":"IF(NOT(ISBLANK(テーブル63[[#This Row],[防水]])),VLOOKUP(テーブル63[[#This Row],[防水]],塗装[],2,TRUE), IF(NOT(ISBLANK(テーブル63[[#This Row],[許可区分（防水）]])),\"D\",\"-\"))","v":"-"},{"$f":"IF(NOT(ISBLANK(テーブル63[[#This Row],[機械器具設置]])),VLOOKUP(テーブル63[[#This Row],[機械器具設置]],塗装[],2,TRUE), IF(NOT(ISBLANK(テーブル63[[#This Row],[許可区分（機械器具）]])),\"D\",\"-\"))","v":"-"},{"$f":"IF(NOT(ISBLANK(テーブル63[[#This Row],[電気通信]])),VLOOKUP(テーブル63[[#This Row],[電気通信]],電気[],2,TRUE), IF(NOT(ISBLANK(テーブル63[[#This Row],[許可区分(電気)]])),\"D\",\"-\"))","v":"-"},{"$f":"IF(NOT(ISBLANK(テーブル63[[#This Row],[水道施設]])),VLOOKUP(テーブル63[[#This Row],[水道施設]],水道[],2,TRUE), IF(NOT(ISBLANK(テーブル63[[#This Row],[許可区分（水道施設）]])),\"D\",\"-\"))","v":"-"}]
[98,"県内","フィデス㈱","千葉市緑区大高町40-15","細矢　充","043-295-1151","043-295-1212",null,null,null,null,"特定",1108,"特定",975,null,null,null,null,null,null,null,null,"一般",772,null,null,{"$f":"IF(NOT(ISBLANK(テーブル63[[#This Row],[土木一式]])),VLOOKUP(テーブル63[[#This Row],[土木一式]],土木[],2,TRUE), IF(NOT(ISBLANK(テーブル63[[#This Row],[許可区分(土木)]])),\"D\",\"-\"))","v":"-"},{"$f":"IF(NOT(ISBLANK(テーブル63[[#This Row],[建築一式]])),VLOOKUP(テーブル63[[#This Row],[建築一式]],建築[],2,TRUE), IF(NOT(ISBLANK(テーブル63[[#This Row],[許可区分（建築）]])),\"D\",\"-\"))","v":"-"},{"$f":"IF(NOT(ISBLANK(テーブル63[[#This Row],[電気]])),VLOOKUP(テーブル63[[#This Row],[電気]],電気[],2,TRUE), IF(NOT(ISBLANK(テーブル63[[#This Row],[許可区分（電気）]])),\"D\",\"-\"))","v":"A"},{"$f":"IF(NOT(ISBLANK(テーブル63[[#This Row],[管]])),VLOOKUP(テーブル63[[#This Row],[管]],管[],2,TRUE), IF(NOT(ISBLANK(テーブル63[[#This Row],[許可区分（管）]])),\"D\",\"-\"))","v":"A"},{"$f":"IF(NOT(ISBLANK(テーブル63[[#This Row],[ほ装]])),VLOOKUP(テーブル63[[#This Row],[ほ装]],ほ装[],2,TRUE), IF(NOT(ISBLANK(テーブル63[[#This Row],[許可区分(ほ装)]])),\"D\",\"-\"))","v":"-"},{"$f":"IF(NOT(ISBLANK(テーブル63[[#This Row],[塗装]])),VLOOKUP(テーブル63[[#This Row],[塗装]],塗装[],2,TRUE), IF(NOT(ISBLANK(テーブル63[[#This Row],[許可区分（塗装）]])),\"D\",\"-\"))","v":"-"},{"$f":"IF(NOT(ISBLANK(テーブル63[[#This Row],[防水]])),VLOOKUP(テーブル63[[#This Row],[防水]],塗装[],2,TRUE), IF(NOT(ISBLANK(テーブル63[[#This Row],[許可区分（防水）]])),\"D\",\"-\"))","v":"-"},{"$f":"IF(NOT(ISBLANK(テーブル63[[#This Row],[機械器具設置]])),VLOOKUP(テーブル63[[#This Row],[機械器具設置]],塗装[],2,TRUE), IF(NOT(ISBLANK(テーブル63[[#This Row],[許可区分（機械器具）]])),\"D\",\"-\"))","v":"-"},{"$f":"IF(NOT(ISBLANK(テーブル63[[#This Row],[電気通信]])),VLOOKUP(テーブル63[[#This Row],[電気通信]],電気[],2,TRUE), IF(NOT(ISBLANK(テーブル63[[#This Row],[許可区分(電気)]])),\"D\",\"-\"))","v":"B"},{"$f":"IF(NOT(ISBLANK(テーブル63[[#This Row],[水道施設]])),VLOOKUP(テーブル63[[#This Row],[水道施設]],水道[],2,TRUE), IF(NOT(ISBLANK(テーブル63[[#This Row],[許可区分（水道施設）]])),\"D\",\"-\"))","v":"-"}]
[99,"県内","㈱入野土木","旭市入野1367","宇井　和則","0479-68-3150","0479-68-4046","特定",932,"一般",725,null,null,"一般",724,"特定",850,null,null,null,null,null,null,null,null,"特定",724,{"$f":"IF(NOT(ISBLANK(テーブル63[[#This Row],[土木一式]])),VLOOKUP(テーブル63[[#This Row],[土木一式]],土木[],2,TRUE), IF(NOT(ISBLANK(テーブル63[[#This Row],[許可区分(土木)]])),\"D\",\"-\"))","v":"A"},{"$f":"IF(NOT(ISBLANK(テーブル63[[#This Row],[建築一式]])),VLOOKUP(テーブル63[[#This Row],[建築一式]],建築[],2,TRUE), IF(NOT(ISBLANK(テーブル63[[#This Row],[許可区分（建築）]])),\"D\",\"-\"))","v":"B"},{"$f":"IF(NOT(ISBLANK(テーブル63[[#This Row],[電気]])),VLOOKUP(テーブル63[[#This Row],[電気]],電気[],2,TRUE), IF(NOT(ISBLANK(テーブル63[[#This Row],[許可区分（電気）]])),\"D\",\"-\"))","v":"-"},{"$f":"IF(NOT(ISBLANK(テーブル63[[#This Row],[管]])),VLOOKUP(テーブル63[[#This Row],[管]],管[],2,TRUE), IF(NOT(ISBLANK(テーブル63[[#This Row],[許可区分（管）]])),\"D\",\"-\"))","v":"A"},{"$f":"IF(NOT(ISBLANK(テーブル63[[#This Row],[ほ装]])),VLOOKUP(テーブル63[[#This Row],[ほ装]],ほ装[],2,TRUE), IF(NOT(ISBLANK(テーブル63[[#This Row],[許可区分(ほ装)]])),\"D\",\"-\"))","v":"A"},{"$f":"IF(NOT(ISBLANK(テーブル63[[#This Row],[塗装]])),VLOOKUP(テーブル63[[#This Row],[塗装]],塗装[],2,TRUE), IF(NOT(ISBLANK(テーブル63[[#This Row],[許可区分（塗装）]])),\"D\",\"-\"))","v":"-"},{"$f":"IF(NOT(ISBLANK(テーブル63[[#This Row],[防水]])),VLOOKUP(テーブル63[[#This Row],[防水]],塗装[],2,TRUE), IF(NOT(ISBLANK(テーブル63[[#This Row],[許可区分（防水）]])),\"D\",\"-\"))","v":"-"},{"$f":"IF(NOT(ISBLANK(テーブル63[[#This Row],[機械器具設置]])),VLOOKUP(テーブル63[[#This Row],[機械器具設置]],塗装[],2,TRUE), IF(NOT(ISBLANK(テーブル63[[#This Row],[許可区分（機械器具）]])),\"D\",\"-\"))","v":"-"},{"$f":"IF(NOT(ISBLANK(テーブル63[[#This Row],[電気通信]])),VLOOKUP(テーブル63[[#This Row],[電気通信]],電気[],2,TRUE), IF(NOT(ISBLANK(テーブル63[[#This Row],[許可区分(電気)]])),\"D\",\"-\"))","v":"-"},{"$f":"IF(NOT(ISBLANK(テーブル63[[#This Row],[水道施設]])),VLOOKUP(テーブル63[[#This Row],[水道施設]],水道[],2,TRUE), IF(NOT(ISBLANK(テーブル63[[#This Row],[許可区分（水道施設）]])),\"D\",\"-\"))","v":"B"}]
[100,"県内","㈱安藤・間　千葉営業所","千葉市中央区富士見1-15-9","梅原　康弘","043-201-2051","043-201-2052","特定",1960,"特定",1990,null,null,null,null,"特定",1351,"特定",1201,"特定",1216,null,null,null,null,"特定",1542,{"$f":"IF(NOT(ISBLANK(テーブル63[[#This Row],[土木一式]])),VLOOKUP(テーブル63[[#This Row],[土木一式]],土木[],2,TRUE), IF(NOT(ISBLANK(テーブル63[[#This Row],[許可区分(土木)]])),\"D\",\"-\"))","v":"A"},{"$f":"IF(NOT(ISBLANK(テーブル63[[#This Row],[建築一式]])),VLOOKUP(テーブル63[[#This Row],[建築一式]],建築[],2,TRUE), IF(NOT(ISBLANK(テーブル63[[#This Row],[許可区分（建築）]])),\"D\",\"-\"))","v":"A"},{"$f":"IF(NOT(ISBLANK(テーブル63[[#This Row],[電気]])),VLOOKUP(テーブル63[[#This Row],[電気]],電気[],2,TRUE), IF(NOT(ISBLANK(テーブル63[[#This Row],[許可区分（電気）]])),\"D\",\"-\"))","v":"-"},{"$f":"IF(NOT(ISBLANK(テーブル63[[#This Row],[管]])),VLOOKUP(テーブル63[[#This Row],[管]],管[],2,TRUE), IF(NOT(ISBLANK(テーブル63[[#This Row],[許可区分（管）]])),\"D\",\"-\"))","v":"-"},{"$f":"IF(NOT(ISBLANK(テーブル63[[#This Row],[ほ装]])),VLOOKUP(テーブル63[[#This Row],[ほ装]],ほ装[],2,TRUE), IF(NOT(ISBLANK(テーブル63[[#This Row],[許可区分(ほ装)]])),\"D\",\"-\"))","v":"A"},{"$f":"IF(NOT(ISBLANK(テーブル63[[#This Row],[塗装]])),VLOOKUP(テーブル63[[#This Row],[塗装]],塗装[],2,TRUE), IF(NOT(ISBLANK(テーブル63[[#This Row],[許可区分（塗装）]])),\"D\",\"-\"))","v":"A"},{"$f":"IF(NOT(ISBLANK(テーブル63[[#This Row],[防水]])),VLOOKUP(テーブル63[[#This Row],[防水]],塗装[],2,TRUE), IF(NOT(ISBLANK(テーブル63[[#This Row],[許可区分（防水）]])),\"D\",\"-\"))","v":"A"},{"$f":"IF(NOT(ISBLANK(テーブル63[[#This Row],[機械器具設置]])),VLOOKUP(テーブル63[[#This Row],[機械器具設置]],塗装[],2,TRUE), IF(NOT(ISBLANK(テーブル63[[#This Row],[許可区分（機械器具）]])),\"D\",\"-\"))","v":"-"},{"$f":"IF(NOT(ISBLANK(テーブル63[[#This Row],[電気通信]])),VLOOKUP(テーブル63[[#This Row],[電気通信]],電気[],2,TRUE), IF(NOT(ISBLANK(テーブル63[[#This Row],[許可区分(電気)]])),\"D\",\"-\"))","v":"-"},{"$f":"IF(NOT(ISBLANK(テーブル63[[#This Row],[水道施設]])),VLOOKUP(テーブル63[[#This Row],[水道施設]],水道[],2,TRUE), IF(NOT(ISBLANK(テーブル63[[#This Row],[許可区分（水道施設）]])),\"D\",\"-\"))","v":"A"}]
[101,"県内","㈱ヤマト　千葉支店","千葉市中央区登戸1-16-4","中村　孝彦","043-242-7133","043-243-1690","特定",1274,"特定",1305,"特定",1326,"特定",1587,null,null,null,null,null,null,"特定",1243,null,null,"特定",1274,{"$f":"IF(NOT(ISBLANK(テーブル63[[#This Row],[土木一式]])),VLOOKUP(テーブル63[[#This Row],[土木一式]],土木[],2,TRUE), IF(NOT(ISBLANK(テーブル63[[#This Row],[許可区分(土木)]])),\"D\",\"-\"))","v":"A"},{"$f":"IF(NOT(ISBLANK(テーブル63[[#This Row],[建築一式]])),VLOOKUP(テーブル63[[#This Row],[建築一式]],建築[],2,TRUE), IF(NOT(ISBLANK(テーブル63[[#This Row],[許可区分（建築）]])),\"D\",\"-\"))","v":"A"},{"$f":"IF(NOT(ISBLANK(テーブル63[[#This Row],[電気]])),VLOOKUP(テーブル63[[#This Row],[電気]],電気[],2,TRUE), IF(NOT(ISBLANK(テーブル63[[#This Row],[許可区分（電気）]])),\"D\",\"-\"))","v":"A"},{"$f":"IF(NOT(ISBLANK(テーブル63[[#This Row],[管]])),VLOOKUP(テーブル63[[#This Row],[管]],管[],2,TRUE), IF(NOT(ISBLANK(テーブル63[[#This Row],[許可区分（管）]])),\"D\",\"-\"))","v":"A"},{"$f":"IF(NOT(ISBLANK(テーブル63[[#This Row],[ほ装]])),VLOOKUP(テーブル63[[#This Row],[ほ装]],ほ装[],2,TRUE), IF(NOT(ISBLANK(テーブル63[[#This Row],[許可区分(ほ装)]])),\"D\",\"-\"))","v":"-"},{"$f":"IF(NOT(ISBLANK(テーブル63[[#This Row],[塗装]])),VLOOKUP(テーブル63[[#This Row],[塗装]],塗装[],2,TRUE), IF(NOT(ISBLANK(テーブル63[[#This Row],[許可区分（塗装）]])),\"D\",\"-\"))","v":"-"},{"$f":"IF(NOT(ISBLANK(テーブル63[[#This Row],[防水]])),VLOOKUP(テーブル63[[#This Row],[防水]],塗装[],2,TRUE), IF(NOT(ISBLANK(テーブル63[[#This Row],[許可区分（防水）]])),\"D\",\"-\"))","v":"-"},{"$f":"IF(NOT(ISBLANK(テーブル63[[#This Row],[機械器具設置]])),VLOOKUP(テーブル63[[#This Row],[機械器具設置]],塗装[],2,TRUE), IF(NOT(ISBLANK(テーブル63[[#This Row],[許可区分（機械器具）]])),\"D\",\"-\"))","v":"A"},{"$f":"IF(NOT(ISBLANK(テーブル63[[#This Row],[電気通信]])),VLOOKUP(テーブル63[[#This Row],[電気通信]],電気[],2,TRUE), IF(NOT(ISBLANK(テーブル63[[#This Row],[許可区分(電気)]])),\"D\",\"-\"))","v":"-"},{"$f":"IF(NOT(ISBLANK(テーブル63[[#This Row],[水道施設]])),VLOOKUP(テーブル63[[#This Row],[水道施設]],水道[],2,TRUE), IF(NOT(ISBLANK(テーブル63[[#This Row],[許可区分（水道施設）]])),\"D\",\"-\"))","v":"A"}]
[102,"県内","新菱冷熱工業㈱　千葉支店","千葉市中央区弁天1-15-3　大宗北口ビル","片山　茂雄","043-287-8291","043-287-8292","特定",1033,"特定",1274,"特定",1528,"特定",1926,null,null,null,null,null,null,"特定",1171,"特定",1190,"特定",1013,{"$f":"IF(NOT(ISBLANK(テーブル63[[#This Row],[土木一式]])),VLOOKUP(テーブル63[[#This Row],[土木一式]],土木[],2,TRUE), IF(NOT(ISBLANK(テーブル63[[#This Row],[許可区分(土木)]])),\"D\",\"-\"))","v":"A"},{"$f":"IF(NOT(ISBLANK(テーブル63[[#This Row],[建築一式]])),VLOOKUP(テーブル63[[#This Row],[建築一式]],建築[],2,TRUE), IF(NOT(ISBLANK(テーブル63[[#This Row],[許可区分（建築）]])),\"D\",\"-\"))","v":"A"},{"$f":"IF(NOT(ISBLANK(テーブル63[[#This Row],[電気]])),VLOOKUP(テーブル63[[#This Row],[電気]],電気[],2,TRUE), IF(NOT(ISBLANK(テーブル63[[#This Row],[許可区分（電気）]])),\"D\",\"-\"))","v":"A"},{"$f":"IF(NOT(ISBLANK(テーブル63[[#This Row],[管]])),VLOOKUP(テーブル63[[#This Row],[管]],管[],2,TRUE), IF(NOT(ISBLANK(テーブル63[[#This Row],[許可区分（管）]])),\"D\",\"-\"))","v":"A"},{"$f":"IF(NOT(ISBLANK(テーブル63[[#This Row],[ほ装]])),VLOOKUP(テーブル63[[#This Row],[ほ装]],ほ装[],2,TRUE), IF(NOT(ISBLANK(テーブル63[[#This Row],[許可区分(ほ装)]])),\"D\",\"-\"))","v":"-"},{"$f":"IF(NOT(ISBLANK(テーブル63[[#This Row],[塗装]])),VLOOKUP(テーブル63[[#This Row],[塗装]],塗装[],2,TRUE), IF(NOT(ISBLANK(テーブル63[[#This Row],[許可区分（塗装）]])),\"D\",\"-\"))","v":"-"},{"$f":"IF(NOT(ISBLANK(テーブル63[[#This Row],[防水]])),VLOOKUP(テーブル63[[#This Row],[防水]],塗装[],2,TRUE), IF(NOT(ISBLANK(テーブル63[[#This Row],[許可区分（防水）]])),\"D\",\"-\"))","v":"-"},{"$f":"IF(NOT(ISBLANK(テーブル63[[#This Row],[機械器具設置]])),VLOOKUP(テーブル63[[#This Row],[機械器具設置]],塗装[],2,TRUE), IF(NOT(ISBLANK(テーブル63[[#This Row],[許可区分（機械器具）]])),\"D\",\"-\"))","v":"A"},{"$f":"IF(NOT(ISBLANK(テーブル63[[#This Row],[電気通信]])),VLOOKUP(テーブル63[[#This Row],[電気通信]],電気[],2,TRUE), IF(NOT(ISBLANK(テーブル63[[#This Row],[許可区分(電気)]])),\"D\",\"-\"))","v":"A"},{"$f":"IF(NOT(ISBLANK(テーブル63[[#This Row],[水道施設]])),VLOOKUP(テーブル63[[#This Row],[水道施設]],水道[],2,TRUE), IF(NOT(ISBLANK(テーブル63[[#This Row],[許可区分（水道施設）]])),\"D\",\"-\"))","v":"A"}]
[103,"県内","㈱秋葉設備工業","山武市上横地3683","秋葉　利夫","0475-82-6394","0475-82-6096","一般",736,null,null,null,null,"一般",761,"一般",643,null,null,null,null,null,null,null,null,"一般",616,{"$f":"IF(NOT(ISBLANK(テーブル63[[#This Row],[土木一式]])),VLOOKUP(テーブル63[[#This Row],[土木一式]],土木[],2,TRUE), IF(NOT(ISBLANK(テーブル63[[#This Row],[許可区分(土木)]])),\"D\",\"-\"))","v":"B"},{"$f":"IF(NOT(ISBLANK(テーブル63[[#This Row],[建築一式]])),VLOOKUP(テーブル63[[#This Row],[建築一式]],建築[],2,TRUE), IF(NOT(ISBLANK(テーブル63[[#This Row],[許可区分（建築）]])),\"D\",\"-\"))","v":"-"},{"$f":"IF(NOT(ISBLANK(テーブル63[[#This Row],[電気]])),VLOOKUP(テーブル63[[#This Row],[電気]],電気[],2,TRUE), IF(NOT(ISBLANK(テーブル63[[#This Row],[許可区分（電気）]])),\"D\",\"-\"))","v":"-"},{"$f":"IF(NOT(ISBLANK(テーブル63[[#This Row],[管]])),VLOOKUP(テーブル63[[#This Row],[管]],管[],2,TRUE), IF(NOT(ISBLANK(テーブル63[[#This Row],[許可区分（管）]])),\"D\",\"-\"))","v":"A"},{"$f":"IF(NOT(ISBLANK(テーブル63[[#This Row],[ほ装]])),VLOOKUP(テーブル63[[#This Row],[ほ装]],ほ装[],2,TRUE), IF(NOT(ISBLANK(テーブル63[[#This Row],[許可区分(ほ装)]])),\"D\",\"-\"))","v":"B"},{"$f":"IF(NOT(ISBLANK(テーブル63[[#This Row],[塗装]])),VLOOKUP(テーブル63[[#This Row],[塗装]],塗装[],2,TRUE), IF(NOT(ISBLANK(テーブル63[[#This Row],[許可区分（塗装）]])),\"D\",\"-\"))","v":"-"},{"$f":"IF(NOT(ISBLANK(テーブル63[[#This Row],[防水]])),VLOOKUP(テーブル63[[#This Row],[防水]],塗装[],2,TRUE), IF(NOT(ISBLANK(テーブル63[[#This Row],[許可区分（防水）]])),\"D\",\"-\"))","v":"-"},{"$f":"IF(NOT(ISBLANK(テーブル63[[#This Row],[機械器具設置]])),VLOOKUP(テーブル63[[#This Row],[機械器具設置]],塗装[],2,TRUE), IF(NOT(ISBLANK(テーブル63[[#This Row],[許可区分（機械器具）]])),\"D\",\"-\"))","v":"-"},{"$f":"IF(NOT(ISBLANK(テーブル63[[#This Row],[電気通信]])),VLOOKUP(テーブル63[[#This Row],[電気通信]],電気[],2,TRUE), IF(NOT(ISBLANK(テーブル63[[#This Row],[許可区分(電気)]])),\"D\",\"-\"))","v":"-"},{"$f":"IF(NOT(ISBLANK(テーブル63[[#This Row],[水道施設]])),VLOOKUP(テーブル63[[#This Row],[水道施設]],水道[],2,TRUE), IF(NOT(ISBLANK(テーブル63[[#This Row],[許可区分（水道施設）]])),\"D\",\"-\"))","v":"C"}]
[104,"県内","㈱植木組　千葉営業所","市川市末広2-20-7","松原　英久","047-399-8453","047-399-8458","特定",1530,null,null,null,null,null,null,"特定",1361,null,null,null,null,null,null,null,null,"特定",1038,{"$f":"IF(NOT(ISBLANK(テーブル63[[#This Row],[土木一式]])),VLOOKUP(テーブル63[[#This Row],[土木一式]],土木[],2,TRUE), IF(NOT(ISBLANK(テーブル63[[#This Row],[許可区分(土木)]])),\"D\",\"-\"))","v":"A"},{"$f":"IF(NOT(ISBLANK(テーブル63[[#This Row],[建築一式]])),VLOOKUP(テーブル63[[#This Row],[建築一式]],建築[],2,TRUE), IF(NOT(ISBLANK(テーブル63[[#This Row],[許可区分（建築）]])),\"D\",\"-\"))","v":"-"},{"$f":"IF(NOT(ISBLANK(テーブル63[[#This Row],[電気]])),VLOOKUP(テーブル63[[#This Row],[電気]],電気[],2,TRUE), IF(NOT(ISBLANK(テーブル63[[#This Row],[許可区分（電気）]])),\"D\",\"-\"))","v":"-"},{"$f":"IF(NOT(ISBLANK(テーブル63[[#This Row],[管]])),VLOOKUP(テーブル63[[#This Row],[管]],管[],2,TRUE), IF(NOT(ISBLANK(テーブル63[[#This Row],[許可区分（管）]])),\"D\",\"-\"))","v":"-"},{"$f":"IF(NOT(ISBLANK(テーブル63[[#This Row],[ほ装]])),VLOOKUP(テーブル63[[#This Row],[ほ装]],ほ装[],2,TRUE), IF(NOT(ISBLANK(テーブル63[[#This Row],[許可区分(ほ装)]])),\"D\",\"-\"))","v":"A"},{"$f":"IF(NOT(ISBLANK(テーブル63[[#This Row],[塗装]])),VLOOKUP(テーブル63[[#This Row],[塗装]],塗装[],2,TRUE), IF(NOT(ISBLANK(テーブル63[[#This Row],[許可区分（塗装）]])),\"D\",\"-\"))","v":"-"},{"$f":"IF(NOT(ISBLANK(テーブル63[[#This Row],[防水]])),VLOOKUP(テーブル63[[#This Row],[防水]],塗装[],2,TRUE), IF(NOT(ISBLANK(テーブル63[[#This Row],[許可区分（防水）]])),\"D\",\"-\"))","v":"-"},{"$f":"IF(NOT(ISBLANK(テーブル63[[#This Row],[機械器具設置]])),VLOOKUP(テーブル63[[#This Row],[機械器具設置]],塗装[],2,TRUE), IF(NOT(ISBLANK(テーブル63[[#This Row],[許可区分（機械器具）]])),\"D\",\"-\"))","v":"-"},{"$f":"IF(NOT(ISBLANK(テーブル63[[#This Row],[電気通信]])),VLOOKUP(テーブル63[[#This Row],[電気通信]],電気[],2,TRUE), IF(NOT(ISBLANK(テーブル63[[#This Row],[許可区分(電気)]])),\"D\",\"-\"))","v":"-"},{"$f":"IF(NOT(ISBLANK(テーブル63[[#This Row],[水道施設]])),VLOOKUP(テーブル63[[#This Row],[水道施設]],水道[],2,TRUE), IF(NOT(ISBLANK(テーブル63[[#This Row],[許可区分（水道施設）]])),\"D\",\"-\"))","v":"A"}]
[105,"県内","三建設備工業㈱東関東支店","千葉市中央区中央1-1-3","山田　幸男","043-227-3501","043-222-9713",null,null,null,null,null,null,"特定",1740,null,null,null,null,null,null,null,null,null,null,null,null,{"$f":"IF(NOT(ISBLANK(テーブル63[[#This Row],[土木一式]])),VLOOKUP(テーブル63[[#This Row],[土木一式]],土木[],2,TRUE), IF(NOT(ISBLANK(テーブル63[[#This Row],[許可区分(土木)]])),\"D\",\"-\"))","v":"-"},{"$f":"IF(NOT(ISBLANK(テーブル63[[#This Row],[建築一式]])),VLOOKUP(テーブル63[[#This Row],[建築一式]],建築[],2,TRUE), IF(NOT(ISBLANK(テーブル63[[#This Row],[許可区分（建築）]])),\"D\",\"-\"))","v":"-"},{"$f":"IF(NOT(ISBLANK(テーブル63[[#This Row],[電気]])),VLOOKUP(テーブル63[[#This Row],[電気]],電気[],2,TRUE), IF(NOT(ISBLANK(テーブル63[[#This Row],[許可区分（電気）]])),\"D\",\"-\"))","v":"-"},{"$f":"IF(NOT(ISBLANK(テーブル63[[#This Row],[管]])),VLOOKUP(テーブル63[[#This Row],[管]],管[],2,TRUE), IF(NOT(ISBLANK(テーブル63[[#This Row],[許可区分（管）]])),\"D\",\"-\"))","v":"A"},{"$f":"IF(NOT(ISBLANK(テーブル63[[#This Row],[ほ装]])),VLOOKUP(テーブル63[[#This Row],[ほ装]],ほ装[],2,TRUE), IF(NOT(ISBLANK(テーブル63[[#This Row],[許可区分(ほ装)]])),\"D\",\"-\"))","v":"-"},{"$f":"IF(NOT(ISBLANK(テーブル63[[#This Row],[塗装]])),VLOOKUP(テーブル63[[#This Row],[塗装]],塗装[],2,TRUE), IF(NOT(ISBLANK(テーブル63[[#This Row],[許可区分（塗装）]])),\"D\",\"-\"))","v":"-"},{"$f":"IF(NOT(ISBLANK(テーブル63[[#This Row],[防水]])),VLOOKUP(テーブル63[[#This Row],[防水]],塗装[],2,TRUE), IF(NOT(ISBLANK(テーブル63[[#This Row],[許可区分（防水）]])),\"D\",\"-\"))","v":"-"},{"$f":"IF(NOT(ISBLANK(テーブル63[[#This Row],[機械器具設置]])),VLOOKUP(テーブル63[[#This Row],[機械器具設置]],塗装[],2,TRUE), IF(NOT(ISBLANK(テーブル63[[#This Row],[許可区分（機械器具）]])),\"D\",\"-\"))","v":"-"},{"$f":"IF(NOT(ISBLANK(テーブル63[[#This Row],[電気通信]])),VLOOKUP(テーブル63[[#This Row],[電気通信]],電気[],2,TRUE), IF(NOT(ISBLANK(テーブル63[[#This Row],[許可区分(電気)]])),\"D\",\"-\"))","v":"-"},{"$f":"IF(NOT(ISBLANK(テーブル63[[#This Row],[水道施設]])),VLOOKUP(テーブル63[[#This Row],[水道施設]],水道[],2,TRUE), IF(NOT(ISBLANK(テーブル63[[#This Row],[許可区分（水道施設）]])),\"D\",\"-\"))","v":"-"}]
[106,"県内","㈱大崎コンピュータエンヂニアリング","千葉市中央区問屋町1-35","堀　裕二","043-246-3685","043-246-3682",null,null,null,null,"特定",1010,"一般",832,null,null,null,null,null,null,"特定",759,"特定",1051,null,null,{"$f":"IF(NOT(ISBLANK(テーブル63[[#This Row],[土木一式]])),VLOOKUP(テーブル63[[#This Row],[土木一式]],土木[],2,TRUE), IF(NOT(ISBLANK(テーブル63[[#This Row],[許可区分(土木)]])),\"D\",\"-\"))","v":"-"},{"$f":"IF(NOT(ISBLANK(テーブル63[[#This Row],[建築一式]])),VLOOKUP(テーブル63[[#This Row],[建築一式]],建築[],2,TRUE), IF(NOT(ISBLANK(テーブル63[[#This Row],[許可区分（建築）]])),\"D\",\"-\"))","v":"-"},{"$f":"IF(NOT(ISBLANK(テーブル63[[#This Row],[電気]])),VLOOKUP(テーブル63[[#This Row],[電気]],電気[],2,TRUE), IF(NOT(ISBLANK(テーブル63[[#This Row],[許可区分（電気）]])),\"D\",\"-\"))","v":"A"},{"$f":"IF(NOT(ISBLANK(テーブル63[[#This Row],[管]])),VLOOKUP(テーブル63[[#This Row],[管]],管[],2,TRUE), IF(NOT(ISBLANK(テーブル63[[#This Row],[許可区分（管）]])),\"D\",\"-\"))","v":"A"},{"$f":"IF(NOT(ISBLANK(テーブル63[[#This Row],[ほ装]])),VLOOKUP(テーブル63[[#This Row],[ほ装]],ほ装[],2,TRUE), IF(NOT(ISBLANK(テーブル63[[#This Row],[許可区分(ほ装)]])),\"D\",\"-\"))","v":"-"},{"$f":"IF(NOT(ISBLANK(テーブル63[[#This Row],[塗装]])),VLOOKUP(テーブル63[[#This Row],[塗装]],塗装[],2,TRUE), IF(NOT(ISBLANK(テーブル63[[#This Row],[許可区分（塗装）]])),\"D\",\"-\"))","v":"-"},{"$f":"IF(NOT(ISBLANK(テーブル63[[#This Row],[防水]])),VLOOKUP(テーブル63[[#This Row],[防水]],塗装[],2,TRUE), IF(NOT(ISBLANK(テーブル63[[#This Row],[許可区分（防水）]])),\"D\",\"-\"))","v":"-"},{"$f":"IF(NOT(ISBLANK(テーブル63[[#This Row],[機械器具設置]])),VLOOKUP(テーブル63[[#This Row],[機械器具設置]],塗装[],2,TRUE), IF(NOT(ISBLANK(テーブル63[[#This Row],[許可区分（機械器具）]])),\"D\",\"-\"))","v":"B"},{"$f":"IF(NOT(ISBLANK(テーブル63[[#This Row],[電気通信]])),VLOOKUP(テーブル63[[#This Row],[電気通信]],電気[],2,TRUE), IF(NOT(ISBLANK(テーブル63[[#This Row],[許可区分(電気)]])),\"D\",\"-\"))","v":"A"},{"$f":"IF(NOT(ISBLANK(テーブル63[[#This Row],[水道施設]])),VLOOKUP(テーブル63[[#This Row],[水道施設]],水道[],2,TRUE), IF(NOT(ISBLANK(テーブル63[[#This Row],[許可区分（水道施設）]])),\"D\",\"-\"))","v":"-"}]
[107,"県内","司機工㈱","千葉市若葉区西都賀2-25-9","反町　俊彦","043-255-2661","043-256-9132",null,null,null,null,"一般",621,null,null,null,null,null,null,null,null,"一般",745,null,null,"一般",700,{"$f":"IF(NOT(ISBLANK(テーブル63[[#This Row],[土木一式]])),VLOOKUP(テーブル63[[#This Row],[土木一式]],土木[],2,TRUE), IF(NOT(ISBLANK(テーブル63[[#This Row],[許可区分(土木)]])),\"D\",\"-\"))","v":"-"},{"$f":"IF(NOT(ISBLANK(テーブル63[[#This Row],[建築一式]])),VLOOKUP(テーブル63[[#This Row],[建築一式]],建築[],2,TRUE), IF(NOT(ISBLANK(テーブル63[[#This Row],[許可区分（建築）]])),\"D\",\"-\"))","v":"-"},{"$f":"IF(NOT(ISBLANK(テーブル63[[#This Row],[電気]])),VLOOKUP(テーブル63[[#This Row],[電気]],電気[],2,TRUE), IF(NOT(ISBLANK(テーブル63[[#This Row],[許可区分（電気）]])),\"D\",\"-\"))","v":"C"},{"$f":"IF(NOT(ISBLANK(テーブル63[[#This Row],[管]])),VLOOKUP(テーブル63[[#This Row],[管]],管[],2,TRUE), IF(NOT(ISBLANK(テーブル63[[#This Row],[許可区分（管）]])),\"D\",\"-\"))","v":"-"},{"$f":"IF(NOT(ISBLANK(テーブル63[[#This Row],[ほ装]])),VLOOKUP(テーブル63[[#This Row],[ほ装]],ほ装[],2,TRUE), IF(NOT(ISBLANK(テーブル63[[#This Row],[許可区分(ほ装)]])),\"D\",\"-\"))","v":"-"},{"$f":"IF(NOT(ISBLANK(テーブル63[[#This Row],[塗装]])),VLOOKUP(テーブル63[[#This Row],[塗装]],塗装[],2,TRUE), IF(NOT(ISBLANK(テーブル63[[#This Row],[許可区分（塗装）]])),\"D\",\"-\"))","v":"-"},{"$f":"IF(NOT(ISBLANK(テーブル63[[#This Row],[防水]])),VLOOKUP(テーブル63[[#This Row],[防水]],塗装[],2,TRUE), IF(NOT(ISBLANK(テーブル63[[#This Row],[許可区分（防水）]])),\"D\",\"-\"))","v":"-"},{"$f":"IF(NOT(ISBLANK(テーブル63[[#This Row],[機械器具設置]])),VLOOKUP(テーブル63[[#This Row],[機械器具設置]],塗装[],2,TRUE), IF(NOT(ISBLANK(テーブル63[[#This Row],[許可区分（機械器具）]])),\"D\",\"-\"))","v":"B"},{"$f":"IF(NOT(ISBLANK(テーブル63[[#This Row],[電気通信]])),VLOOKUP(テーブル63[[#This Row],[電気通信]],電気[],2,TRUE), IF(NOT(ISBLANK(テーブル63[[#This Row],[許可区分(電気)]])),\"D\",\"-\"))","v":"-"},{"$f":"IF(NOT(ISBLANK(テーブル63[[#This Row],[水道施設]])),VLOOKUP(テーブル63[[#This Row],[水道施設]],水道[],2,TRUE), IF(NOT(ISBLANK(テーブル63[[#This Row],[許可区分（水道施設）]])),\"D\",\"-\"))","v":"B"}]
[108,"県内","㈱ハマダ　千葉事業所","市原市出津西1-1-41","帽田　晶義","0436-24-6777","0436-24-7150","特定",1315,"特定",1255,null,null,"特定",1024,"特定",989,null,null,null,null,"特定",1161,null,null,"特定",1157,{"$f":"IF(NOT(ISBLANK(テーブル63[[#This Row],[土木一式]])),VLOOKUP(テーブル63[[#This Row],[土木一式]],土木[],2,TRUE), IF(NOT(ISBLANK(テーブル63[[#This Row],[許可区分(土木)]])),\"D\",\"-\"))","v":"A"},{"$f":"IF(NOT(ISBLANK(テーブル63[[#This Row],[建築一式]])),VLOOKUP(テーブル63[[#This Row],[建築一式]],建築[],2,TRUE), IF(NOT(ISBLANK(テーブル63[[#This Row],[許可区分（建築）]])),\"D\",\"-\"))","v":"A"},{"$f":"IF(NOT(ISBLANK(テーブル63[[#This Row],[電気]])),VLOOKUP(テーブル63[[#This Row],[電気]],電気[],2,TRUE), IF(NOT(ISBLANK(テーブル63[[#This Row],[許可区分（電気）]])),\"D\",\"-\"))","v":"-"},{"$f":"IF(NOT(ISBLANK(テーブル63[[#This Row],[管]])),VLOOKUP(テーブル63[[#This Row],[管]],管[],2,TRUE), IF(NOT(ISBLANK(テーブル63[[#This Row],[許可区分（管）]])),\"D\",\"-\"))","v":"A"},{"$f":"IF(NOT(ISBLANK(テーブル63[[#This Row],[ほ装]])),VLOOKUP(テーブル63[[#This Row],[ほ装]],ほ装[],2,TRUE), IF(NOT(ISBLANK(テーブル63[[#This Row],[許可区分(ほ装)]])),\"D\",\"-\"))","v":"A"},{"$f":"IF(NOT(ISBLANK(テーブル63[[#This Row],[塗装]])),VLOOKUP(テーブル63[[#This Row],[塗装]],塗装[],2,TRUE), IF(NOT(ISBLANK(テーブル63[[#This Row],[許可区分（塗装）]])),\"D\",\"-\"))","v":"-"},{"$f":"IF(NOT(ISBLANK(テーブル63[[#This Row],[防水]])),VLOOKUP(テーブル63[[#This Row],[防水]],塗装[],2,TRUE), IF(NOT(ISBLANK(テーブル63[[#This Row],[許可区分（防水）]])),\"D\",\"-\"))","v":"-"},{"$f":"IF(NOT(ISBLANK(テーブル63[[#This Row],[機械器具設置]])),VLOOKUP(テーブル63[[#This Row],[機械器具設置]],塗装[],2,TRUE), IF(NOT(ISBLANK(テーブル63[[#This Row],[許可区分（機械器具）]])),\"D\",\"-\"))","v":"A"},{"$f":"IF(NOT(ISBLANK(テーブル63[[#This Row],[電気通信]])),VLOOKUP(テーブル63[[#This Row],[電気通信]],電気[],2,TRUE), IF(NOT(ISBLANK(テーブル63[[#This Row],[許可区分(電気)]])),\"D\",\"-\"))","v":"-"},{"$f":"IF(NOT(ISBLANK(テーブル63[[#This Row],[水道施設]])),VLOOKUP(テーブル63[[#This Row],[水道施設]],水道[],2,TRUE), IF(NOT(ISBLANK(テーブル63[[#This Row],[許可区分（水道施設）]])),\"D\",\"-\"))","v":"A"}]
[109,"県内","大和リース㈱　千葉支店","千葉市中央区弁天1-5-1","赤埴　博之","043-331-6180","043-331-6181",null,null,"特定",1836,null,null,null,null,null,null,null,null,null,null,null,null,null,null,null,null,{"$f":"IF(NOT(ISBLANK(テーブル63[[#This Row],[土木一式]])),VLOOKUP(テーブル63[[#This Row],[土木一式]],土木[],2,TRUE), IF(NOT(ISBLANK(テーブル63[[#This Row],[許可区分(土木)]])),\"D\",\"-\"))","v":"-"},{"$f":"IF(NOT(ISBLANK(テーブル63[[#This Row],[建築一式]])),VLOOKUP(テーブル63[[#This Row],[建築一式]],建築[],2,TRUE), IF(NOT(ISBLANK(テーブル63[[#This Row],[許可区分（建築）]])),\"D\",\"-\"))","v":"A"},{"$f":"IF(NOT(ISBLANK(テーブル63[[#This Row],[電気]])),VLOOKUP(テーブル63[[#This Row],[電気]],電気[],2,TRUE), IF(NOT(ISBLANK(テーブル63[[#This Row],[許可区分（電気）]])),\"D\",\"-\"))","v":"-"},{"$f":"IF(NOT(ISBLANK(テーブル63[[#This Row],[管]])),VLOOKUP(テーブル63[[#This Row],[管]],管[],2,TRUE), IF(NOT(ISBLANK(テーブル63[[#This Row],[許可区分（管）]])),\"D\",\"-\"))","v":"-"},{"$f":"IF(NOT(ISBLANK(テーブル63[[#This Row],[ほ装]])),VLOOKUP(テーブル63[[#This Row],[ほ装]],ほ装[],2,TRUE), IF(NOT(ISBLANK(テーブル63[[#This Row],[許可区分(ほ装)]])),\"D\",\"-\"))","v":"-"},{"$f":"IF(NOT(ISBLANK(テーブル63[[#This Row],[塗装]])),VLOOKUP(テーブル63[[#This Row],[塗装]],塗装[],2,TRUE), IF(NOT(ISBLANK(テーブル63[[#This Row],[許可区分（塗装）]])),\"D\",\"-\"))","v":"-"},{"$f":"IF(NOT(ISBLANK(テーブル63[[#This Row],[防水]])),VLOOKUP(テーブル63[[#This Row],[防水]],塗装[],2,TRUE), IF(NOT(ISBLANK(テーブル63[[#This Row],[許可区分（防水）]])),\"D\",\"-\"))","v":"-"},{"$f":"IF(NOT(ISBLANK(テーブル63[[#This Row],[機械器具設置]])),VLOOKUP(テーブル63[[#This Row],[機械器具設置]],塗装[],2,TRUE), IF(NOT(ISBLANK(テーブル63[[#This Row],[許可区分（機械器具）]])),\"D\",\"-\"))","v":"-"},{"$f":"IF(NOT(ISBLANK(テーブル63[[#This Row],[電気通信]])),VLOOKUP(テーブル63[[#This Row],[電気通信]],電気[],2,TRUE), IF(NOT(ISBLANK(テーブル63[[#This Row],[許可区分(電気)]])),\"D\",\"-\"))","v":"-"},{"$f":"IF(NOT(ISBLANK(テーブル63[[#This Row],[水道施設]])),VLOOKUP(テーブル63[[#This Row],[水道施設]],水道[],2,TRUE), IF(NOT(ISBLANK(テーブル63[[#This Row],[許可区分（水道施設）]])),\"D\",\"-\"))","v":"-"}]
[110,"県内","東日本電信電話㈱　千葉事業部","千葉市美浜区中瀬1-3　幕張テクノガーデンD棟13階","執行役員　千葉事業部長　境　麻千子","043-211-4154","043-299-0420",null,null,null,null,null,null,null,null,null,null,null,null,null,null,null,null,"特定",1623,null,null,{"$f":"IF(NOT(ISBLANK(テーブル63[[#This Row],[土木一式]])),VLOOKUP(テーブル63[[#This Row],[土木一式]],土木[],2,TRUE), IF(NOT(ISBLANK(テーブル63[[#This Row],[許可区分(土木)]])),\"D\",\"-\"))","v":"-"},{"$f":"IF(NOT(ISBLANK(テーブル63[[#This Row],[建築一式]])),VLOOKUP(テーブル63[[#This Row],[建築一式]],建築[],2,TRUE), IF(NOT(ISBLANK(テーブル63[[#This Row],[許可区分（建築）]])),\"D\",\"-\"))","v":"-"},{"$f":"IF(NOT(ISBLANK(テーブル63[[#This Row],[電気]])),VLOOKUP(テーブル63[[#This Row],[電気]],電気[],2,TRUE), IF(NOT(ISBLANK(テーブル63[[#This Row],[許可区分（電気）]])),\"D\",\"-\"))","v":"-"},{"$f":"IF(NOT(ISBLANK(テーブル63[[#This Row],[管]])),VLOOKUP(テーブル63[[#This Row],[管]],管[],2,TRUE), IF(NOT(ISBLANK(テーブル63[[#This Row],[許可区分（管）]])),\"D\",\"-\"))","v":"-"},{"$f":"IF(NOT(ISBLANK(テーブル63[[#This Row],[ほ装]])),VLOOKUP(テーブル63[[#This Row],[ほ装]],ほ装[],2,TRUE), IF(NOT(ISBLANK(テーブル63[[#This Row],[許可区分(ほ装)]])),\"D\",\"-\"))","v":"-"},{"$f":"IF(NOT(ISBLANK(テーブル63[[#This Row],[塗装]])),VLOOKUP(テーブル63[[#This Row],[塗装]],塗装[],2,TRUE), IF(NOT(ISBLANK(テーブル63[[#This Row],[許可区分（塗装）]])),\"D\",\"-\"))","v":"-"},{"$f":"IF(NOT(ISBLANK(テーブル63[[#This Row],[防水]])),VLOOKUP(テーブル63[[#This Row],[防水]],塗装[],2,TRUE), IF(NOT(ISBLANK(テーブル63[[#This Row],[許可区分（防水）]])),\"D\",\"-\"))","v":"-"},{"$f":"IF(NOT(ISBLANK(テーブル63[[#This Row],[機械器具設置]])),VLOOKUP(テーブル63[[#This Row],[機械器具設置]],塗装[],2,TRUE), IF(NOT(ISBLANK(テーブル63[[#This Row],[許可区分（機械器具）]])),\"D\",\"-\"))","v":"-"},{"$f":"IF(NOT(ISBLANK(テーブル63[[#This Row],[電気通信]])),VLOOKUP(テーブル63[[#This Row],[電気通信]],電気[],2,TRUE), IF(NOT(ISBLANK(テーブル63[[#This Row],[許可区分(電気)]])),\"D\",\"-\"))","v":"A"},{"$f":"IF(NOT(ISBLANK(テーブル63[[#This Row],[水道施設]])),VLOOKUP(テーブル63[[#This Row],[水道施設]],水道[],2,TRUE), IF(NOT(ISBLANK(テーブル63[[#This Row],[許可区分（水道施設）]])),\"D\",\"-\"))","v":"-"}]
[111,"県内","三菱電機プラントエンジニアリング㈱　東日本本部　千葉営業所","千葉市中央区新町24-9","寺崎　茂","043-248-0795","043-248-0799",null,null,null,null,"特定",1622,null,null,null,null,null,null,null,null,"一般",1059,"特定",1237,null,null,{"$f":"IF(NOT(ISBLANK(テーブル63[[#This Row],[土木一式]])),VLOOKUP(テーブル63[[#This Row],[土木一式]],土木[],2,TRUE), IF(NOT(ISBLANK(テーブル63[[#This Row],[許可区分(土木)]])),\"D\",\"-\"))","v":"-"},{"$f":"IF(NOT(ISBLANK(テーブル63[[#This Row],[建築一式]])),VLOOKUP(テーブル63[[#This Row],[建築一式]],建築[],2,TRUE), IF(NOT(ISBLANK(テーブル63[[#This Row],[許可区分（建築）]])),\"D\",\"-\"))","v":"-"},{"$f":"IF(NOT(ISBLANK(テーブル63[[#This Row],[電気]])),VLOOKUP(テーブル63[[#This Row],[電気]],電気[],2,TRUE), IF(NOT(ISBLANK(テーブル63[[#This Row],[許可区分（電気）]])),\"D\",\"-\"))","v":"A"},{"$f":"IF(NOT(ISBLANK(テーブル63[[#This Row],[管]])),VLOOKUP(テーブル63[[#This Row],[管]],管[],2,TRUE), IF(NOT(ISBLANK(テーブル63[[#This Row],[許可区分（管）]])),\"D\",\"-\"))","v":"-"},{"$f":"IF(NOT(ISBLANK(テーブル63[[#This Row],[ほ装]])),VLOOKUP(テーブル63[[#This Row],[ほ装]],ほ装[],2,TRUE), IF(NOT(ISBLANK(テーブル63[[#This Row],[許可区分(ほ装)]])),\"D\",\"-\"))","v":"-"},{"$f":"IF(NOT(ISBLANK(テーブル63[[#This Row],[塗装]])),VLOOKUP(テーブル63[[#This Row],[塗装]],塗装[],2,TRUE), IF(NOT(ISBLANK(テーブル63[[#This Row],[許可区分（塗装）]])),\"D\",\"-\"))","v":"-"},{"$f":"IF(NOT(ISBLANK(テーブル63[[#This Row],[防水]])),VLOOKUP(テーブル63[[#This Row],[防水]],塗装[],2,TRUE), IF(NOT(ISBLANK(テーブル63[[#This Row],[許可区分（防水）]])),\"D\",\"-\"))","v":"-"},{"$f":"IF(NOT(ISBLANK(テーブル63[[#This Row],[機械器具設置]])),VLOOKUP(テーブル63[[#This Row],[機械器具設置]],塗装[],2,TRUE), IF(NOT(ISBLANK(テーブル63[[#This Row],[許可区分（機械器具）]])),\"D\",\"-\"))","v":"A"},{"$f":"IF(NOT(ISBLANK(テーブル63[[#This Row],[電気通信]])),VLOOKUP(テーブル63[[#This Row],[電気通信]],電気[],2,TRUE), IF(NOT(ISBLANK(テーブル63[[#This Row],[許可区分(電気)]])),\"D\",\"-\"))","v":"A"},{"$f":"IF(NOT(ISBLANK(テーブル63[[#This Row],[水道施設]])),VLOOKUP(テーブル63[[#This Row],[水道施設]],水道[],2,TRUE), IF(NOT(ISBLANK(テーブル63[[#This Row],[許可区分（水道施設）]])),\"D\",\"-\"))","v":"-"}]

{"sheet":"公表名簿（県外建設)","index":2,"n_rows":35,"n_cols":37,"rows_kept":35,"cut":false,"hidden":false,"merged":[[0,6,0,11]]}
["八匝水道企業団建設工事等入札参加業者資格者名簿（県外建設）　",null,null,null,null,null,{"$f":"TODAY()","v":"2021-12-21"}]
["番号","区域","商号又は名称","所在地","代表者氏名","電話番号","ＦＡＸ","許可区分(土木)","土木一式","許可区分（建築）","建築一式","許可区分（電気）","電気","許可区分（管）","管","許可区分(ほ装)","ほ装","許可区分（塗装）","塗装","許可区分（防水）","防水","許可区分（機械器具）","機械器具設置","許可区分(電気)","電気通信","許可区分（水道施設）","水道施設","土木一式(等級)","建築一式(等級)","電気(等級)","管(等級)","ほ装(等級)","塗装(等級)","防水(等級)","機械器具設置(等級)","電気通信(等級)","水道施設(等級)"]
[1,"県外","㈱ベルテクノ","愛知県名古屋市中区錦3-5-27","鈴木　洋","052-857-9001","052-857-9006","特定",825,null,null,null,null,"特定",697,null,null,null,null,null,null,null,null,null,null,"特定",1070,{"$f":"IF(NOT(ISBLANK(テーブル635[[#This Row],[土木一式]])),VLOOKUP(テーブル635[[#This Row],[土木一式]],土木[],2,TRUE), IF(NOT(ISBLANK(テーブル635[[#This Row],[許可区分(土木)]])),\"D\",\"-\"))","v":"A"},{"$f":"IF(NOT(ISBLANK(テーブル635[[#This Row],[建築一式]])),VLOOKUP(テーブル635[[#This Row],[建築一式]],建築[],2,TRUE), IF(NOT(ISBLANK(テーブル635[[#This Row],[許可区分（建築）]])),\"D\",\"-\"))","v":"-"},{"$f":"IF(NOT(ISBLANK(テーブル635[[#This Row],[電気]])),VLOOKUP(テーブル635[[#This Row],[電気]],電気[],2,TRUE), IF(NOT(ISBLANK(テーブル635[[#This Row],[許可区分（電気）]])),\"D\",\"-\"))","v":"-"},{"$f":"IF(NOT(ISBLANK(テーブル635[[#This Row],[管]])),VLOOKUP(テーブル635[[#This Row],[管]],管[],2,TRUE), IF(NOT(ISBLANK(テーブル635[[#This Row],[許可区分（管）]])),\"D\",\"-\"))","v":"B"},{"$f":"IF(NOT(ISBLANK(テーブル635[[#This Row],[ほ装]])),VLOOKUP(テーブル635[[#This Row],[ほ装]],ほ装[],2,TRUE), IF(NOT(ISBLANK(テーブル635[[#This Row],[許可区分(ほ装)]])),\"D\",\"-\"))","v":"-"},{"$f":"IF(NOT(ISBLANK(テーブル635[[#This Row],[塗装]])),VLOOKUP(テーブル635[[#This Row],[塗装]],塗装[],2,TRUE), IF(NOT(ISBLANK(テーブル635[[#This Row],[許可区分（塗装）]])),\"D\",\"-\"))","v":"-"},{"$f":"IF(NOT(ISBLANK(テーブル635[[#This Row],[防水]])),VLOOKUP(テーブル635[[#This Row],[防水]],塗装[],2,TRUE), IF(NOT(ISBLANK(テーブル635[[#This Row],[許可区分（防水）]])),\"D\",\"-\"))","v":"-"},{"$f":"IF(NOT(ISBLANK(テーブル635[[#This Row],[機械器具設置]])),VLOOKUP(テーブル635[[#This Row],[機械器具設置]],塗装[],2,TRUE), IF(NOT(ISBLANK(テーブル635[[#This Row],[許可区分（機械器具）]])),\"D\",\"-\"))","v":"-"},{"$f":"IF(NOT(ISBLANK(テーブル635[[#This Row],[電気通信]])),VLOOKUP(テーブル635[[#This Row],[電気通信]],電気[],2,TRUE), IF(NOT(ISBLANK(テーブル635[[#This Row],[許可区分(電気)]])),\"D\",\"-\"))","v":"-"},{"$f":"IF(NOT(ISBLANK(テーブル635[[#This Row],[水道施設]])),VLOOKUP(テーブル635[[#This Row],[水道施設]],水道[],2,TRUE), IF(NOT(ISBLANK(テーブル635[[#This Row],[許可区分（水道施設）]])),\"D\",\"-\"))","v":"A"}]
[2,"県外","清水建設㈱　土木東京支店","東京都中央区京橋2-16-1-10","桑原　泰秀","03-3561-3857","03-3561-8668","特定",2012,"特定",2042,null,null,null,null,"特定",1263,"特定",1560,"特定",1603,"特定",1093,null,null,"特定",1632,{"$f":"IF(NOT(ISBLANK(テーブル635[[#This Row],[土木一式]])),VLOOKUP(テーブル635[[#This Row],[土木一式]],土木[],2,TRUE), IF(NOT(ISBLANK(テーブル635[[#This Row],[許可区分(土木)]])),\"D\",\"-\"))","v":"A"},{"$f":"IF(NOT(ISBLANK(テーブル635[[#This Row],[建築一式]])),VLOOKUP(テーブル635[[#This Row],[建築一式]],建築[],2,TRUE), IF(NOT(ISBLANK(テーブル635[[#This Row],[許可区分（建築）]])),\"D\",\"-\"))","v":"A"},{"$f":"IF(NOT(ISBLANK(テーブル635[[#This Row],[電気]])),VLOOKUP(テーブル635[[#This Row],[電気]],電気[],2,TRUE), IF(NOT(ISBLANK(テーブル635[[#This Row],[許可区分（電気）]])),\"D\",\"-\"))","v":"-"},{"$f":"IF(NOT(ISBLANK(テーブル635[[#This Row],[管]])),VLOOKUP(テーブル635[[#This Row],[管]],管[],2,TRUE), IF(NOT(ISBLANK(テーブル635[[#This Row],[許可区分（管）]])),\"D\",\"-\"))","v":"-"},{"$f":"IF(NOT(ISBLANK(テーブル635[[#This Row],[ほ装]])),VLOOKUP(テーブル635[[#This Row],[ほ装]],ほ装[],2,TRUE), IF(NOT(ISBLANK(テーブル635[[#This Row],[許可区分(ほ装)]])),\"D\",\"-\"))","v":"A"},{"$f":"IF(NOT(ISBLANK(テーブル635[[#This Row],[塗装]])),VLOOKUP(テーブル635[[#This Row],[塗装]],塗装[],2,TRUE), IF(NOT(ISBLANK(テーブル635[[#This Row],[許可区分（塗装）]])),\"D\",\"-\"))","v":"A"},{"$f":"IF(NOT(ISBLANK(テーブル635[[#This Row],[防水]])),VLOOKUP(テーブル635[[#This Row],[防水]],塗装[],2,TRUE), IF(NOT(ISBLANK(テーブル635[[#This Row],[許可区分（防水）]])),\"D\",\"-\"))","v":"A"},{"$f":"IF(NOT(ISBLANK(テーブル635[[#This Row],[機械器具設置]])),VLOOKUP(テーブル635[[#This Row],[機械器具設置]],塗装[],2,TRUE), IF(NOT(ISBLANK(テーブル635[[#This Row],[許可区分（機械器具）]])),\"D\",\"-\"))","v":"A"},{"$f":"IF(NOT(ISBLANK(テーブル635[[#This Row],[電気通信]])),VLOOKUP(テーブル635[[#This Row],[電気通信]],電気[],2,TRUE), IF(NOT(ISBLANK(テーブル635[[#This Row],[許可区分(電気)]])),\"D\",\"-\"))","v":"-"},{"$f":"IF(NOT(ISBLANK(テーブル635[[#This Row],[水道施設]])),VLOOKUP(テーブル635[[#This Row],[水道施設]],水道[],2,TRUE), IF(NOT(ISBLANK(テーブル635[[#This Row],[許可区分（水道施設）]])),\"D\",\"-\"))","v":"A"}]
[3,"県外","日立造船㈱　東京本社　環境営業統括部長","東京都品川区南大井6-26-3","石川　英司","03-6404-0823","03-6404-0862",null,null,null,null,null,null,"特定",1330,null,null,"特定",1042,null,null,"特定",1691,null,null,"特定",1392,{"$f":"IF(NOT(ISBLANK(テーブル635[[#This Row],[土木一式]])),VLOOKUP(テーブル635[[#This Row],[土木一式]],土木[],2,TRUE), IF(NOT(ISBLANK(テーブル635[[#This Row],[許可区分(土木)]])),\"D\",\"-\"))","v":"-"},{"$f":"IF(NOT(ISBLANK(テーブル635[[#This Row],[建築一式]])),VLOOKUP(テーブル635[[#This Row],[建築一式]],建築[],2,TRUE), IF(NOT(ISBLANK(テーブル635[[#This Row],[許可区分（建築）]])),\"D\",\"-\"))","v":"-"},{"$f":"IF(NOT(ISBLANK(テーブル635[[#This Row],[電気]])),VLOOKUP(テーブル635[[#This Row],[電気]],電気[],2,TRUE), IF(NOT(ISBLANK(テーブル635[[#This Row],[許可区分（電気）]])),\"D\",\"-\"))","v":"-"},{"$f":"IF(NOT(ISBLANK(テーブル635[[#This Row],[管]])),VLOOKUP(テーブル635[[#This Row],[管]],管[],2,TRUE), IF(NOT(ISBLANK(テーブル635[[#This Row],[許可区分（管）]])),\"D\",\"-\"))","v":"A"},{"$f":"IF(NOT(ISBLANK(テーブル635[[#This Row],[ほ装]])),VLOOKUP(テーブル635[[#This Row],[ほ装]],ほ装[],2,TRUE), IF(NOT(ISBLANK(テーブル635[[#This Row],[許可区分(ほ装)]])),\"D\",\"-\"))","v":"-"},{"$f":"IF(NOT(ISBLANK(テーブル635[[#This Row],[塗装]])),VLOOKUP(テーブル635[[#This Row],[塗装]],塗装[],2,TRUE), IF(NOT(ISBLANK(テーブル635[[#This Row],[許可区分（塗装）]])),\"D\",\"-\"))","v":"A"},{"$f":"IF(NOT(ISBLANK(テーブル635[[#This Row],[防水]])),VLOOKUP(テーブル635[[#This Row],[防水]],塗装[],2,TRUE), IF(NOT(ISBLANK(テーブル635[[#This Row],[許可区分（防水）]])),\"D\",\"-\"))","v":"-"},{"$f":"IF(NOT(ISBLANK(テーブル635[[#This Row],[機械器具設置]])),VLOOKUP(テーブル635[[#This Row],[機械器具設置]],塗装[],2,TRUE), IF(NOT(ISBLANK(テーブル635[[#This Row],[許可区分（機械器具）]])),\"D\",\"-\"))","v":"A"},{"$f":"IF(NOT(ISBLANK(テーブル635[[#This Row],[電気通信]])),VLOOKUP(テーブル635[[#This Row],[電気通信]],電気[],2,TRUE), IF(NOT(ISBLANK(テーブル635[[#This Row],[許可区分(電気)]])),\"D\",\"-\"))","v":"-"},{"$f":"IF(NOT(ISBLANK(テーブル635[[#This Row],[水道施設]])),VLOOKUP(テーブル635[[#This Row],[水道施設]],水道[],2,TRUE), IF(NOT(ISBLANK(テーブル635[[#This Row],[許可区分（水道施設）]])),\"D\",\"-\"))","v":"A"}]
[4,"県外","㈱フソウ 東京支社","東京都中央区日本橋室町2-3-1","柴原　晃","03-6880-2124","03-3552-7075","特定",1330,"特定",1128,"特定",1270,"特定",1321,null,null,null,null,null,null,"特定",1367,null,null,"特定",1442,{"$f":"IF(NOT(ISBLANK(テーブル635[[#This Row],[土木一式]])),VLOOKUP(テーブル635[[#This Row],[土木一式]],土木[],2,TRUE), IF(NOT(ISBLANK(テーブル635[[#This Row],[許可区分(土木)]])),\"D\",\"-\"))","v":"A"},{"$f":"IF(NOT(ISBLANK(テーブル635[[#This Row],[建築一式]])),VLOOKUP(テーブル635[[#This Row],[建築一式]],建築[],2,TRUE), IF(NOT(ISBLANK(テーブル635[[#This Row],[許可区分（建築）]])),\"D\",\"-\"))","v":"A"},{"$f":"IF(NOT(ISBLANK(テーブル635[[#This Row],[電気]])),VLOOKUP(テーブル635[[#This Row],[電気]],電気[],2,TRUE), IF(NOT(ISBLANK(テーブル635[[#This Row],[許可区分（電気）]])),\"D\",\"-\"))","v":"A"},{"$f":"IF(NOT(ISBLANK(テーブル635[[#This Row],[管]])),VLOOKUP(テーブル635[[#This Row],[管]],管[],2,TRUE), IF(NOT(ISBLANK(テーブル635[[#This Row],[許可区分（管）]])),\"D\",\"-\"))","v":"A"},{"$f":"IF(NOT(ISBLANK(テーブル635[[#This Row],[ほ装]])),VLOOKUP(テーブル635[[#This Row],[ほ装]],ほ装[],2,TRUE), IF(NOT(ISBLANK(テーブル635[[#This Row],[許可区分(ほ装)]])),\"D\",\"-\"))","v":"-"},{"$f":"IF(NOT(ISBLANK(テーブル635[[#This Row],[塗装]])),VLOOKUP(テーブル635[[#This Row],[塗装]],塗装[],2,TRUE), IF(NOT(ISBLANK(テーブル635[[#This Row],[許可区分（塗装）]])),\"D\",\"-\"))","v":"-"},{"$f":"IF(NOT(ISBLANK(テーブル635[[#This Row],[防水]])),VLOOKUP(テーブル635[[#This Row],[防水]],塗装[],2,TRUE), IF(NOT(ISBLANK(テーブル635[[#This Row],[許可区分（防水）]])),\"D\",\"-\"))","v":"-"},{"$f":"IF(NOT(ISBLANK(テーブル635[[#This Row],[機械器具設置]])),VLOOKUP(テーブル635[[#This Row],[機械器具設置]],塗装[],2,TRUE), IF(NOT(ISBLANK(テーブル635[[#This Row],[許可区分（機械器具）]])),\"D\",\"-\"))","v":"A"},{"$f":"IF(NOT(ISBLANK(テーブル635[[#This Row],[電気通信]])),VLOOKUP(テーブル635[[#This Row],[電気通信]],電気[],2,TRUE), IF(NOT(ISBLANK(テーブル635[[#This Row],[許可区分(電気)]])),\"D\",\"-\"))","v":"-"},{"$f":"IF(NOT(ISBLANK(テーブル635[[#This Row],[水道施設]])),VLOOKUP(テーブル635[[#This Row],[水道施設]],水道[],2,TRUE), IF(NOT(ISBLANK(テーブル635[[#This Row],[許可区分（水道施設）]])),\"D\",\"-\"))","v":"A"}]
[5,"県外","㈱栗本鐵工所　東京支社","東京都港区港南2-16-2","髙僧　英樹","03-3450-8521","03-6880-2229",null,null,null,null,null,null,"特定",949,null,null,null,null,null,null,"特定",1274,null,null,"特定",1169,{"$f":"IF(NOT(ISBLANK(テーブル635[[#This Row],[土木一式]])),VLOOKUP(テーブル635[[#This Row],[土木一式]],土木[],2,TRUE), IF(NOT(ISBLANK(テーブル635[[#This Row],[許可区分(土木)]])),\"D\",\"-\"))","v":"-"},{"$f":"IF(NOT(ISBLANK(テーブル635[[#This Row],[建築一式]])),VLOOKUP(テーブル635[[#This Row],[建築一式]],建築[],2,TRUE), IF(NOT(ISBLANK(テーブル635[[#This Row],[許可区分（建築）]])),\"D\",\"-\"))","v":"-"},{"$f":"IF(NOT(ISBLANK(テーブル635[[#This Row],[電気]])),VLOOKUP(テーブル635[[#This Row],[電気]],電気[],2,TRUE), IF(NOT(ISBLANK(テーブル635[[#This Row],[許可区分（電気）]])),\"D\",\"-\"))","v":"-"},{"$f":"IF(NOT(ISBLANK(テーブル635[[#This Row],[管]])),VLOOKUP(テーブル635[[#This Row],[管]],管[],2,TRUE), IF(NOT(ISBLANK(テーブル635[[#This Row],[許可区分（管）]])),\"D\",\"-\"))","v":"A"},{"$f":"IF(NOT(ISBLANK(テーブル635[[#This Row],[ほ装]])),VLOOKUP(テーブル635[[#This Row],[ほ装]],ほ装[],2,TRUE), IF(NOT(ISBLANK(テーブル635[[#This Row],[許可区分(ほ装)]])),\"D\",\"-\"))","v":"-"},{"$f":"IF(NOT(ISBLANK(テーブル635[[#This Row],[塗装]])),VLOOKUP(テーブル635[[#This Row],[塗装]],塗装[],2,TRUE), IF(NOT(ISBLANK(テーブル635[[#This Row],[許可区分（塗装）]])),\"D\",\"-\"))","v":"-"},{"$f":"IF(NOT(ISBLANK(テーブル635[[#This Row],[防水]])),VLOOKUP(テーブル635[[#This Row],[防水]],塗装[],2,TRUE), IF(NOT(ISBLANK(テーブル635[[#This Row],[許可区分（防水）]])),\"D\",\"-\"))","v":"-"},{"$f":"IF(NOT(ISBLANK(テーブル635[[#This Row],[機械器具設置]])),VLOOKUP(テーブル635[[#This Row],[機械器具設置]],塗装[],2,TRUE), IF(NOT(ISBLANK(テーブル635[[#This Row],[許可区分（機械器具）]])),\"D\",\"-\"))","v":"A"},{"$f":"IF(NOT(ISBLANK(テーブル635[[#This Row],[電気通信]])),VLOOKUP(テーブル635[[#This Row],[電気通信]],電気[],2,TRUE), IF(NOT(ISBLANK(テーブル635[[#This Row],[許可区分(電気)]])),\"D\",\"-\"))","v":"-"},{"$f":"IF(NOT(ISBLANK(テーブル635[[#This Row],[水道施設]])),VLOOKUP(テーブル635[[#This Row],[水道施設]],水道[],2,TRUE), IF(NOT(ISBLANK(テーブル635[[#This Row],[許可区分（水道施設）]])),\"D\",\"-\"))","v":"A"}]
[6,"県外","西川計測㈱","東京都渋谷区代々木3-22-7","田中　勝彦","03-3299-1341","03-3299-1460",null,null,null,null,"特定",1275,null,null,null,null,null,null,null,null,"特定",1078,"特定",1243,null,null,{"$f":"IF(NOT(ISBLANK(テーブル635[[#This Row],[土木一式]])),VLOOKUP(テーブル635[[#This Row],[土木一式]],土木[],2,TRUE), IF(NOT(ISBLANK(テーブル635[[#This Row],[許可区分(土木)]])),\"D\",\"-\"))","v":"-"},{"$f":"IF(NOT(ISBLANK(テーブル635[[#This Row],[建築一式]])),VLOOKUP(テーブル635[[#This Row],[建築一式]],建築[],2,TRUE), IF(NOT(ISBLANK(テーブル635[[#This Row],[許可区分（建築）]])),\"D\",\"-\"))","v":"-"},{"$f":"IF(NOT(ISBLANK(テーブル635[[#This Row],[電気]])),VLOOKUP(テーブル635[[#This Row],[電気]],電気[],2,TRUE), IF(NOT(ISBLANK(テーブル635[[#This Row],[許可区分（電気）]])),\"D\",\"-\"))","v":"A"},{"$f":"IF(NOT(ISBLANK(テーブル635[[#This Row],[管]])),VLOOKUP(テーブル635[[#This Row],[管]],管[],2,TRUE), IF(NOT(ISBLANK(テーブル635[[#This Row],[許可区分（管）]])),\"D\",\"-\"))","v":"-"},{"$f":"IF(NOT(ISBLANK(テーブル635[[#This Row],[ほ装]])),VLOOKUP(テーブル635[[#This Row],[ほ装]],ほ装[],2,TRUE), IF(NOT(ISBLANK(テーブル635[[#This Row],[許可区分(ほ装)]])),\"D\",\"-\"))","v":"-"},{"$f":"IF(NOT(ISBLANK(テーブル635[[#This Row],[塗装]])),VLOOKUP(テーブル635[[#This Row],[塗装]],塗装[],2,TRUE), IF(NOT(ISBLANK(テーブル635[[#This Row],[許可区分（塗装）]])),\"D\",\"-\"))","v":"-"},{"$f":"IF(NOT(ISBLANK(テーブル635[[#This Row],[防水]])),VLOOKUP(テーブル635[[#This Row],[防水]],塗装[],2,TRUE), IF(NOT(ISBLANK(テーブル635[[#This Row],[許可区分（防水）]])),\"D\",\"-\"))","v":"-"},{"$f":"IF(NOT(ISBLANK(テーブル635[[#This Row],[機械器具設置]])),VLOOKUP(テーブル635[[#This Row],[機械器具設置]],塗装[],2,TRUE), IF(NOT(ISBLANK(テーブル635[[#This Row],[許可区分（機械器具）]])),\"D\",\"-\"))","v":"A"},{"$f":"IF(NOT(ISBLANK(テーブル635[[#This Row],[電気通信]])),VLOOKUP(テーブル635[[#This Row],[電気通信]],電気[],2,TRUE), IF(NOT(ISBLANK(テーブル635[[#This Row],[許可区分(電気)]])),\"D\",\"-\"))","v":"A"},{"$f":"IF(NOT(ISBLANK(テーブル635[[#This Row],[水道施設]])),VLOOKUP(テーブル635[[#This Row],[水道施設]],水道[],2,TRUE), IF(NOT(ISBLANK(テーブル635[[#This Row],[許可区分（水道施設）]])),\"D\",\"-\"))","v":"-"}]
[7,"県外","㈱データベース　東京支店","東京都中央区日本橋本町2-18-12","清重　正樹","03-5641-1381","03-5641-1384","特定",742,"特定",700,"特定",919,"特定",763,"特定",700,"特定",700,null,null,"一般",757,null,null,"特定",787,{"$f":"IF(NOT(ISBLANK(テーブル635[[#This Row],[土木一式]])),VLOOKUP(テーブル635[[#This Row],[土木一式]],土木[],2,TRUE), IF(NOT(ISBLANK(テーブル635[[#This Row],[許可区分(土木)]])),\"D\",\"-\"))","v":"B"},{"$f":"IF(NOT(ISBLANK(テーブル635[[#This Row],[建築一式]])),VLOOKUP(テーブル635[[#This Row],[建築一式]],建築[],2,TRUE), IF(NOT(ISBLANK(テーブル635[[#This Row],[許可区分（建築）]])),\"D\",\"-\"))","v":"B"},{"$f":"IF(NOT(ISBLANK(テーブル635[[#This Row],[電気]])),VLOOKUP(テーブル635[[#This Row],[電気]],電気[],2,TRUE), IF(NOT(ISBLANK(テーブル635[[#This Row],[許可区分（電気）]])),\"D\",\"-\"))","v":"A"},{"$f":"IF(NOT(ISBLANK(テーブル635[[#This Row],[管]])),VLOOKUP(テーブル635[[#This Row],[管]],管[],2,TRUE), IF(NOT(ISBLANK(テーブル635[[#This Row],[許可区分（管）]])),\"D\",\"-\"))","v":"A"},{"$f":"IF(NOT(ISBLANK(テーブル635[[#This Row],[ほ装]])),VLOOKUP(テーブル635[[#This Row],[ほ装]],ほ装[],2,TRUE), IF(NOT(ISBLANK(テーブル635[[#This Row],[許可区分(ほ装)]])),\"D\",\"-\"))","v":"A"},{"$f":"IF(NOT(ISBLANK(テーブル635[[#This Row],[塗装]])),VLOOKUP(テーブル635[[#This Row],[塗装]],塗装[],2,TRUE), IF(NOT(ISBLANK(テーブル635[[#This Row],[許可区分（塗装）]])),\"D\",\"-\"))","v":"B"},{"$f":"IF(NOT(ISBLANK(テーブル635[[#This Row],[防水]])),VLOOKUP(テーブル635[[#This Row],[防水]],塗装[],2,TRUE), IF(NOT(ISBLANK(テーブル635[[#This Row],[許可区分（防水）]])),\"D\",\"-\"))","v":"-"},{"$f":"IF(NOT(ISBLANK(テーブル635[[#This Row],[機械器具設置]])),VLOOKUP(テーブル635[[#This Row],[機械器具設置]],塗装[],2,TRUE), IF(NOT(ISBLANK(テーブル635[[#This Row],[許可区分（機械器具）]])),\"D\",\"-\"))","v":"B"},{"$f":"IF(NOT(ISBLANK(テーブル635[[#This Row],[電気通信]])),VLOOKUP(テーブル635[[#This Row],[電気通信]],電気[],2,TRUE), IF(NOT(ISBLANK(テーブル635[[#This Row],[許可区分(電気)]])),\"D\",\"-\"))","v":"-"},{"$f":"IF(NOT(ISBLANK(テーブル635[[#This Row],[水道施設]])),VLOOKUP(テーブル635[[#This Row],[水道施設]],水道[],2,TRUE), IF(NOT(ISBLANK(テーブル635[[#This Row],[許可区分（水道施設）]])),\"D\",\"-\"))","v":"B"}]
[8,"県外","安田㈱","東京都練馬区関町北5-8-5","山本　睦基","03-5991-7161","03-5991-7163","特定",725,null,null,null,null,null,null,null,null,null,null,null,null,null,null,null,null,"特定",1084,{"$f":"IF(NOT(ISBLANK(テーブル635[[#This Row],[土木一式]])),VLOOKUP(テーブル635[[#This Row],[土木一式]],土木[],2,TRUE), IF(NOT(ISBLANK(テーブル635[[#This Row],[許可区分(土木)]])),\"D\",\"-\"))","v":"B"},{"$f":"IF(NOT(ISBLANK(テーブル635[[#This Row],[建築一式]])),VLOOKUP(テーブル635[[#This Row],[建築一式]],建築[],2,TRUE), IF(NOT(ISBLANK(テーブル635[[#This Row],[許可区分（建築）]])),\"D\",\"-\"))","v":"-"},{"$f":"IF(NOT(ISBLANK(テーブル635[[#This Row],[電気]])),VLOOKUP(テーブル635[[#This Row],[電気]],電気[],2,TRUE), IF(NOT(ISBLANK(テーブル635[[#This Row],[許可区分（電気）]])),\"D\",\"-\"))","v":"-"},{"$f":"IF(NOT(ISBLANK(テーブル635[[#This Row],[管]])),VLOOKUP(テーブル635[[#This Row],[管]],管[],2,TRUE), IF(NOT(ISBLANK(テーブル635[[#This Row],[許可区分（管）]])),\"D\",\"-\"))","v":"-"},{"$f":"IF(NOT(ISBLANK(テーブル635[[#This Row],[ほ装]])),VLOOKUP(テーブル635[[#This Row],[ほ装]],ほ装[],2,TRUE), IF(NOT(ISBLANK(テーブル635[[#This Row],[許可区分(ほ装)]])),\"D\",\"-\"))","v":"-"},{"$f":"IF(NOT(ISBLANK(テーブル635[[#This Row],[塗装]])),VLOOKUP(テーブル635[[#This Row],[塗装]],塗装[],2,TRUE), IF(NOT(ISBLANK(テーブル635[[#This Row],[許可区分（塗装）]])),\"D\",\"-\"))","v":"-"},{"$f":"IF(NOT(ISBLANK(テーブル635[[#This Row],[防水]])),VLOOKUP(テーブル635[[#This Row],[防水]],塗装[],2,TRUE), IF(NOT(ISBLANK(テーブル635[[#This Row],[許可区分（防水）]])),\"D\",\"-\"))","v":"-"},{"$f":"IF(NOT(ISBLANK(テーブル635[[#This Row],[機械器具設置]])),VLOOKUP(テーブル635[[#This Row],[機械器具設置]],塗装[],2,TRUE), IF(NOT(ISBLANK(テーブル635[[#This Row],[許可区分（機械器具）]])),\"D\",\"-\"))","v":"-"},{"$f":"IF(NOT(ISBLANK(テーブル635[[#This Row],[電気通信]])),VLOOKUP(テーブル635[[#This Row],[電気通信]],電気[],2,TRUE), IF(NOT(ISBLANK(テーブル635[[#This Row],[許可区分(電気)]])),\"D\",\"-\"))","v":"-"},{"$f":"IF(NOT(ISBLANK(テーブル635[[#This Row],[水道施設]])),VLOOKUP(テーブル635[[#This Row],[水道施設]],水道[],2,TRUE), IF(NOT(ISBLANK(テーブル635[[#This Row],[許可区分（水道施設）]])),\"D\",\"-\"))","v":"A"}]
[9,"県外","㈱森田鉄工所　東京営業支店","東京都千代田区岩本町1-8-15","奥村　一志","03-5820-3090","03-5820-3081",null,null,null,null,null,null,null,null,null,null,null,null,null,null,"特定",892,null,null,"特定",861,{"$f":"IF(NOT(ISBLANK(テーブル635[[#This Row],[土木一式]])),VLOOKUP(テーブル635[[#This Row],[土木一式]],土木[],2,TRUE), IF(NOT(ISBLANK(テーブル635[[#This Row],[許可区分(土木)]])),\"D\",\"-\"))","v":"-"},{"$f":"IF(NOT(ISBLANK(テーブル635[[#This Row],[建築一式]])),VLOOKUP(テーブル635[[#This Row],[建築一式]],建築[],2,TRUE), IF(NOT(ISBLANK(テーブル635[[#This Row],[許可区分（建築）]])),\"D\",\"-\"))","v":"-"},{"$f":"IF(NOT(ISBLANK(テーブル635[[#This Row],[電気]])),VLOOKUP(テーブル635[[#This Row],[電気]],電気[],2,TRUE), IF(NOT(ISBLANK(テーブル635[[#This Row],[許可区分（電気）]])),\"D\",\"-\"))","v":"-"},{"$f":"IF(NOT(ISBLANK(テーブル635[[#This Row],[管]])),VLOOKUP(テーブル635[[#This Row],[管]],管[],2,TRUE), IF(NOT(ISBLANK(テーブル635[[#This Row],[許可区分（管）]])),\"D\",\"-\"))","v":"-"},{"$f":"IF(NOT(ISBLANK(テーブル635[[#This Row],[ほ装]])),VLOOKUP(テーブル635[[#This Row],[ほ装]],ほ装[],2,TRUE), IF(NOT(ISBLANK(テーブル635[[#This Row],[許可区分(ほ装)]])),\"D\",\"-\"))","v":"-"},{"$f":"IF(NOT(ISBLANK(テーブル635[[#This Row],[塗装]])),VLOOKUP(テーブル635[[#This Row],[塗装]],塗装[],2,TRUE), IF(NOT(ISBLANK(テーブル635[[#This Row],[許可区分（塗装）]])),\"D\",\"-\"))","v":"-"},{"$f":"IF(NOT(ISBLANK(テーブル635[[#This Row],[防水]])),VLOOKUP(テーブル635[[#This Row],[防水]],塗装[],2,TRUE), IF(NOT(ISBLANK(テーブル635[[#This Row],[許可区分（防水）]])),\"D\",\"-\"))","v":"-"},{"$f":"IF(NOT(ISBLANK(テーブル635[[#This Row],[機械器具設置]])),VLOOKUP(テーブル635[[#This Row],[機械器具設置]],塗装[],2,TRUE), IF(NOT(ISBLANK(テーブル635[[#This Row],[許可区分（機械器具）]])),\"D\",\"-\"))","v":"A"},{"$f":"IF(NOT(ISBLANK(テーブル635[[#This Row],[電気通信]])),VLOOKUP(テーブル635[[#This Row],[電気通信]],電気[],2,TRUE), IF(NOT(ISBLANK(テーブル635[[#This Row],[許可区分(電気)]])),\"D\",\"-\"))","v":"-"},{"$f":"IF(NOT(ISBLANK(テーブル635[[#This Row],[水道施設]])),VLOOKUP(テーブル635[[#This Row],[水道施設]],水道[],2,TRUE), IF(NOT(ISBLANK(テーブル635[[#This Row],[許可区分（水道施設）]])),\"D\",\"-\"))","v":"A"}]
[10,"県外","共和化工㈱　関東支店","東京都品川区西五反田7-25-19","髙田　真人","03-3494-1312","03-3494-1386","特定",763,"特定",666,"特定",701,"特定",908,null,null,null,null,null,null,"特定",1008,null,null,"特定",940,{"$f":"IF(NOT(ISBLANK(テーブル635[[#This Row],[土木一式]])),VLOOKUP(テーブル635[[#This Row],[土木一式]],土木[],2,TRUE), IF(NOT(ISBLANK(テーブル635[[#This Row],[許可区分(土木)]])),\"D\",\"-\"))","v":"A"},{"$f":"IF(NOT(ISBLANK(テーブル635[[#This Row],[建築一式]])),VLOOKUP(テーブル635[[#This Row],[建築一式]],建築[],2,TRUE), IF(NOT(ISBLANK(テーブル635[[#This Row],[許可区分（建築）]])),\"D\",\"-\"))","v":"C"},{"$f":"IF(NOT(ISBLANK(テーブル635[[#This Row],[電気]])),VLOOKUP(テーブル635[[#This Row],[電気]],電気[],2,TRUE), IF(NOT(ISBLANK(テーブル635[[#This Row],[許可区分（電気）]])),\"D\",\"-\"))","v":"B"},{"$f":"IF(NOT(ISBLANK(テーブル635[[#This Row],[管]])),VLOOKUP(テーブル635[[#This Row],[管]],管[],2,TRUE), IF(NOT(ISBLANK(テーブル635[[#This Row],[許可区分（管）]])),\"D\",\"-\"))","v":"A"},{"$f":"IF(NOT(ISBLANK(テーブル635[[#This Row],[ほ装]])),VLOOKUP(テーブル635[[#This Row],[ほ装]],ほ装[],2,TRUE), IF(NOT(ISBLANK(テーブル635[[#This Row],[許可区分(ほ装)]])),\"D\",\"-\"))","v":"-"},{"$f":"IF(NOT(ISBLANK(テーブル635[[#This Row],[塗装]])),VLOOKUP(テーブル635[[#This Row],[塗装]],塗装[],2,TRUE), IF(NOT(ISBLANK(テーブル635[[#This Row],[許可区分（塗装）]])),\"D\",\"-\"))","v":"-"},{"$f":"IF(NOT(ISBLANK(テーブル635[[#This Row],[防水]])),VLOOKUP(テーブル635[[#This Row],[防水]],塗装[],2,TRUE), IF(NOT(ISBLANK(テーブル635[[#This Row],[許可区分（防水）]])),\"D\",\"-\"))","v":"-"},{"$f":"IF(NOT(ISBLANK(テーブル635[[#This Row],[機械器具設置]])),VLOOKUP(テーブル635[[#This Row],[機械器具設置]],塗装[],2,TRUE), IF(NOT(ISBLANK(テーブル635[[#This Row],[許可区分（機械器具）]])),\"D\",\"-\"))","v":"A"},{"$f":"IF(NOT(ISBLANK(テーブル635[[#This Row],[電気通信]])),VLOOKUP(テーブル635[[#This Row],[電気通信]],電気[],2,TRUE), IF(NOT(ISBLANK(テーブル635[[#This Row],[許可区分(電気)]])),\"D\",\"-\"))","v":"-"},{"$f":"IF(NOT(ISBLANK(テーブル635[[#This Row],[水道施設]])),VLOOKUP(テーブル635[[#This Row],[水道施設]],水道[],2,TRUE), IF(NOT(ISBLANK(テーブル635[[#This Row],[許可区分（水道施設）]])),\"D\",\"-\"))","v":"A"}]
[11,"県外","新日本工業㈱　東京営業所","東京都江戸川区平井4-7-16徳久ビル5階","奥田　武","03-6658-4081","03-6658-4083","特定",635,null,null,null,null,null,null,null,null,"特定",637,null,null,null,null,null,null,"特定",852,{"$f":"IF(NOT(ISBLANK(テーブル635[[#This Row],[土木一式]])),VLOOKUP(テーブル635[[#This Row],[土木一式]],土木[],2,TRUE), IF(NOT(ISBLANK(テーブル635[[#This Row],[許可区分(土木)]])),\"D\",\"-\"))","v":"C"},{"$f":"IF(NOT(ISBLANK(テーブル635[[#This Row],[建築一式]])),VLOOKUP(テーブル635[[#This Row],[建築一式]],建築[],2,TRUE), IF(NOT(ISBLANK(テーブル635[[#This Row],[許可区分（建築）]])),\"D\",\"-\"))","v":"-"},{"$f":"IF(NOT(ISBLANK(テーブル635[[#This Row],[電気]])),VLOOKUP(テーブル635[[#This Row],[電気]],電気[],2,TRUE), IF(NOT(ISBLANK(テーブル635[[#This Row],[許可区分（電気）]])),\"D\",\"-\"))","v":"-"},{"$f":"IF(NOT(ISBLANK(テーブル635[[#This Row],[管]])),VLOOKUP(テーブル635[[#This Row],[管]],管[],2,TRUE), IF(NOT(ISBLANK(テーブル635[[#This Row],[許可区分（管）]])),\"D\",\"-\"))","v":"-"},{"$f":"IF(NOT(ISBLANK(テーブル635[[#This Row],[ほ装]])),VLOOKUP(テーブル635[[#This Row],[ほ装]],ほ装[],2,TRUE), IF(NOT(ISBLANK(テーブル635[[#This Row],[許可区分(ほ装)]])),\"D\",\"-\"))","v":"-"},{"$f":"IF(NOT(ISBLANK(テーブル635[[#This Row],[塗装]])),VLOOKUP(テーブル635[[#This Row],[塗装]],塗装[],2,TRUE), IF(NOT(ISBLANK(テーブル635[[#This Row],[許可区分（塗装）]])),\"D\",\"-\"))","v":"C"},{"$f":"IF(NOT(ISBLANK(テーブル635[[#This Row],[防水]])),VLOOKUP(テーブル635[[#This Row],[防水]],塗装[],2,TRUE), IF(NOT(ISBLANK(テーブル635[[#This Row],[許可区分（防水）]])),\"D\",\"-\"))","v":"-"},{"$f":"IF(NOT(ISBLANK(テーブル635[[#This Row],[機械器具設置]])),VLOOKUP(テーブル635[[#This Row],[機械器具設置]],塗装[],2,TRUE), IF(NOT(ISBLANK(テーブル635[[#This Row],[許可区分（機械器具）]])),\"D\",\"-\"))","v":"-"},{"$f":"IF(NOT(ISBLANK(テーブル635[[#This Row],[電気通信]])),VLOOKUP(テーブル635[[#This Row],[電気通信]],電気[],2,TRUE), IF(NOT(ISBLANK(テーブル635[[#This Row],[許可区分(電気)]])),\"D\",\"-\"))","v":"-"},{"$f":"IF(NOT(ISBLANK(テーブル635[[#This Row],[水道施設]])),VLOOKUP(テーブル635[[#This Row],[水道施設]],水道[],2,TRUE), IF(NOT(ISBLANK(テーブル635[[#This Row],[許可区分（水道施設）]])),\"D\",\"-\"))","v":"A"}]
[12,"県外","㈱石垣　営業本部　東京営業部","東京都千代田区丸の内1-6-5","野口　周士","03-6848-7822","03-6848-7902",null,null,null,null,null,null,null,null,null,null,null,null,null,null,"特定",1316,null,null,"特定",1121,{"$f":"IF(NOT(ISBLANK(テーブル635[[#This Row],[土木一式]])),VLOOKUP(テーブル635[[#This Row],[土木一式]],土木[],2,TRUE), IF(NOT(ISBLANK(テーブル635[[#This Row],[許可区分(土木)]])),\"D\",\"-\"))","v":"-"},{"$f":"IF(NOT(ISBLANK(テーブル635[[#This Row],[建築一式]])),VLOOKUP(テーブル635[[#This Row],[建築一式]],建築[],2,TRUE), IF(NOT(ISBLANK(テーブル635[[#This Row],[許可区分（建築）]])),\"D\",\"-\"))","v":"-"},{"$f":"IF(NOT(ISBLANK(テーブル635[[#This Row],[電気]])),VLOOKUP(テーブル635[[#This Row],[電気]],電気[],2,TRUE), IF(NOT(ISBLANK(テーブル635[[#This Row],[許可区分（電気）]])),\"D\",\"-\"))","v":"-"},{"$f":"IF(NOT(ISBLANK(テーブル635[[#This Row],[管]])),VLOOKUP(テーブル635[[#This Row],[管]],管[],2,TRUE), IF(NOT(ISBLANK(テーブル635[[#This Row],[許可区分（管）]])),\"D\",\"-\"))","v":"-"},{"$f":"IF(NOT(ISBLANK(テーブル635[[#This Row],[ほ装]])),VLOOKUP(テーブル635[[#This Row],[ほ装]],ほ装[],2,TRUE), IF(NOT(ISBLANK(テーブル635[[#This Row],[許可区分(ほ装)]])),\"D\",\"-\"))","v":"-"},{"$f":"IF(NOT(ISBLANK(テーブル635[[#This Row],[塗装]])),VLOOKUP(テーブル635[[#This Row],[塗装]],塗装[],2,TRUE), IF(NOT(ISBLANK(テーブル635[[#This Row],[許可区分（塗装）]])),\"D\",\"-\"))","v":"-"},{"$f":"IF(NOT(ISBLANK(テーブル635[[#This Row],[防水]])),VLOOKUP(テーブル635[[#This Row],[防水]],塗装[],2,TRUE), IF(NOT(ISBLANK(テーブル635[[#This Row],[許可区分（防水）]])),\"D\",\"-\"))","v":"-"},{"$f":"IF(NOT(ISBLANK(テーブル635[[#This Row],[機械器具設置]])),VLOOKUP(テーブル635[[#This Row],[機械器具設置]],塗装[],2,TRUE), IF(NOT(ISBLANK(テーブル635[[#This Row],[許可区分（機械器具）]])),\"D\",\"-\"))","v":"A"},{"$f":"IF(NOT(ISBLANK(テーブル635[[#This Row],[電気通信]])),VLOOKUP(テーブル635[[#This Row],[電気通信]],電気[],2,TRUE), IF(NOT(ISBLANK(テーブル635[[#This Row],[許可区分(電気)]])),\"D\",\"-\"))","v":"-"},{"$f":"IF(NOT(ISBLANK(テーブル635[[#This Row],[水道施設]])),VLOOKUP(テーブル635[[#This Row],[水道施設]],水道[],2,TRUE), IF(NOT(ISBLANK(テーブル635[[#This Row],[許可区分（水道施設）]])),\"D\",\"-\"))","v":"A"}]
[13,"県外","㈱岩城　東京営業所","東京都大田区北嶺町14-9フォレスト北嶺101号室","亀岡　正典","03-6809-5991","03-6809-5992","特定",783,null,null,null,null,"特定",679,null,null,"特定",704,null,null,"一般",766,null,null,"特定",902,{"$f":"IF(NOT(ISBLANK(テーブル635[[#This Row],[土木一式]])),VLOOKUP(テーブル635[[#This Row],[土木一式]],土木[],2,TRUE), IF(NOT(ISBLANK(テーブル635[[#This Row],[許可区分(土木)]])),\"D\",\"-\"))","v":"A"},{"$f":"IF(NOT(ISBLANK(テーブル635[[#This Row],[建築一式]])),VLOOKUP(テーブル635[[#This Row],[建築一式]],建築[],2,TRUE), IF(NOT(ISBLANK(テーブル635[[#This Row],[許可区分（建築）]])),\"D\",\"-\"))","v":"-"},{"$f":"IF(NOT(ISBLANK(テーブル635[[#This Row],[電気]])),VLOOKUP(テーブル635[[#This Row],[電気]],電気[],2,TRUE), IF(NOT(ISBLANK(テーブル635[[#This Row],[許可区分（電気）]])),\"D\",\"-\"))","v":"-"},{"$f":"IF(NOT(ISBLANK(テーブル635[[#This Row],[管]])),VLOOKUP(テーブル635[[#This Row],[管]],管[],2,TRUE), IF(NOT(ISBLANK(テーブル635[[#This Row],[許可区分（管）]])),\"D\",\"-\"))","v":"B"},{"$f":"IF(NOT(ISBLANK(テーブル635[[#This Row],[ほ装]])),VLOOKUP(テーブル635[[#This Row],[ほ装]],ほ装[],2,TRUE), IF(NOT(ISBLANK(テーブル635[[#This Row],[許可区分(ほ装)]])),\"D\",\"-\"))","v":"-"},{"$f":"IF(NOT(ISBLANK(テーブル635[[#This Row],[塗装]])),VLOOKUP(テーブル635[[#This Row],[塗装]],塗装[],2,TRUE), IF(NOT(ISBLANK(テーブル635[[#This Row],[許可区分（塗装）]])),\"D\",\"-\"))","v":"B"},{"$f":"IF(NOT(ISBLANK(テーブル635[[#This Row],[防水]])),VLOOKUP(テーブル635[[#This Row],[防水]],塗装[],2,TRUE), IF(NOT(ISBLANK(テーブル635[[#This Row],[許可区分（防水）]])),\"D\",\"-\"))","v":"-"},{"$f":"IF(NOT(ISBLANK(テーブル635[[#This Row],[機械器具設置]])),VLOOKUP(テーブル635[[#This Row],[機械器具設置]],塗装[],2,TRUE), IF(NOT(ISBLANK(テーブル635[[#This Row],[許可区分（機械器具）]])),\"D\",\"-\"))","v":"B"},{"$f":"IF(NOT(ISBLANK(テーブル635[[#This Row],[電気通信]])),VLOOKUP(テーブル635[[#This Row],[電気通信]],電気[],2,TRUE), IF(NOT(ISBLANK(テーブル635[[#This Row],[許可区分(電気)]])),\"D\",\"-\"))","v":"-"},{"$f":"IF(NOT(ISBLANK(テーブル635[[#This Row],[水道施設]])),VLOOKUP(テーブル635[[#This Row],[水道施設]],水道[],2,TRUE), IF(NOT(ISBLANK(テーブル635[[#This Row],[許可区分（水道施設）]])),\"D\",\"-\"))","v":"A"}]
[14,"県外","シンフォニアテクノロジー㈱　社会インフラシステム営業部","東京都港区芝大門1-1-30","林　和孝","03-5473-1830","03-5473-1846",null,null,null,null,"特定",1489,null,null,null,null,null,null,null,null,"特定",1201,"特定",1193,null,null,{"$f":"IF(NOT(ISBLANK(テーブル635[[#This Row],[土木一式]])),VLOOKUP(テーブル635[[#This Row],[土木一式]],土木[],2,TRUE), IF(NOT(ISBLANK(テーブル635[[#This Row],[許可区分(土木)]])),\"D\",\"-\"))","v":"-"},{"$f":"IF(NOT(ISBLANK(テーブル635[[#This Row],[建築一式]])),VLOOKUP(テーブル635[[#This Row],[建築一式]],建築[],2,TRUE), IF(NOT(ISBLANK(テーブル635[[#This Row],[許可区分（建築）]])),\"D\",\"-\"))","v":"-"},{"$f":"IF(NOT(ISBLANK(テーブル635[[#This Row],[電気]])),VLOOKUP(テーブル635[[#This Row],[電気]],電気[],2,TRUE), IF(NOT(ISBLANK(テーブル635[[#This Row],[許可区分（電気）]])),\"D\",\"-\"))","v":"A"},{"$f":"IF(NOT(ISBLANK(テーブル635[[#This Row],[管]])),VLOOKUP(テーブル635[[#This Row],[管]],管[],2,TRUE), IF(NOT(ISBLANK(テーブル635[[#This Row],[許可区分（管）]])),\"D\",\"-\"))","v":"-"},{"$f":"IF(NOT(ISBLANK(テーブル635[[#This Row],[ほ装]])),VLOOKUP(テーブル635[[#This Row],[ほ装]],ほ装[],2,TRUE), IF(NOT(ISBLANK(テーブル635[[#This Row],[許可区分(ほ装)]])),\"D\",\"-\"))","v":"-"},{"$f":"IF(NOT(ISBLANK(テーブル635[[#This Row],[塗装]])),VLOOKUP(テーブル635[[#This Row],[塗装]],塗装[],2,TRUE), IF(NOT(ISBLANK(テーブル635[[#This Row],[許可区分（塗装）]])),\"D\",\"-\"))","v":"-"},{"$f":"IF(NOT(ISBLANK(テーブル635[[#This Row],[防水]])),VLOOKUP(テーブル635[[#This Row],[防水]],塗装[],2,TRUE), IF(NOT(ISBLANK(テーブル635[[#This Row],[許可区分（防水）]])),\"D\",\"-\"))","v":"-"},{"$f":"IF(NOT(ISBLANK(テーブル635[[#This Row],[機械器具設置]])),VLOOKUP(テーブル635[[#This Row],[機械器具設置]],塗装[],2,TRUE), IF(NOT(ISBLANK(テーブル635[[#This Row],[許可区分（機械器具）]])),\"D\",\"-\"))","v":"A"},{"$f":"IF(NOT(ISBLANK(テーブル635[[#This Row],[電気通信]])),VLOOKUP(テーブル635[[#This Row],[電気通信]],電気[],2,TRUE), IF(NOT(ISBLANK(テーブル635[[#This Row],[許可区分(電気)]])),\"D\",\"-\"))","v":"A"},{"$f":"IF(NOT(ISBLANK(テーブル635[[#This Row],[水道施設]])),VLOOKUP(テーブル635[[#This Row],[水道施設]],水道[],2,TRUE), IF(NOT(ISBLANK(テーブル635[[#This Row],[許可区分（水道施設）]])),\"D\",\"-\"))","v":"-"}]
[15,"県外","前澤工業㈱　東京支店","東京都中央区新川1-5-17","腰越　建","03-3297-0611","03-3297-0619","特定",934,null,null,null,null,null,null,null,null,null,null,null,null,"特定",1269,null,null,"特定",1303,{"$f":"IF(NOT(ISBLANK(テーブル635[[#This Row],[土木一式]])),VLOOKUP(テーブル635[[#This Row],[土木一式]],土木[],2,TRUE), IF(NOT(ISBLANK(テーブル635[[#This Row],[許可区分(土木)]])),\"D\",\"-\"))","v":"A"},{"$f":"IF(NOT(ISBLANK(テーブル635[[#This Row],[建築一式]])),VLOOKUP(テーブル635[[#This Row],[建築一式]],建築[],2,TRUE), IF(NOT(ISBLANK(テーブル635[[#This Row],[許可区分（建築）]])),\"D\",\"-\"))","v":"-"},{"$f":"IF(NOT(ISBLANK(テーブル635[[#This Row],[電気]])),VLOOKUP(テーブル635[[#This Row],[電気]],電気[],2,TRUE), IF(NOT(ISBLANK(テーブル635[[#This Row],[許可区分（電気）]])),\"D\",\"-\"))","v":"-"},{"$f":"IF(NOT(ISBLANK(テーブル635[[#This Row],[管]])),VLOOKUP(テーブル635[[#This Row],[管]],管[],2,TRUE), IF(NOT(ISBLANK(テーブル635[[#This Row],[許可区分（管）]])),\"D\",\"-\"))","v":"-"},{"$f":"IF(NOT(ISBLANK(テーブル635[[#This Row],[ほ装]])),VLOOKUP(テーブル635[[#This Row],[ほ装]],ほ装[],2,TRUE), IF(NOT(ISBLANK(テーブル635[[#This Row],[許可区分(ほ装)]])),\"D\",\"-\"))","v":"-"},{"$f":"IF(NOT(ISBLANK(テーブル635[[#This Row],[塗装]])),VLOOKUP(テーブル635[[#This Row],[塗装]],塗装[],2,TRUE), IF(NOT(ISBLANK(テーブル635[[#This Row],[許可区分（塗装）]])),\"D\",\"-\"))","v":"-"},{"$f":"IF(NOT(ISBLANK(テーブル635[[#This Row],[防水]])),VLOOKUP(テーブル635[[#This Row],[防水]],塗装[],2,TRUE), IF(NOT(ISBLANK(テーブル635[[#This Row],[許可区分（防水）]])),\"D\",\"-\"))","v":"-"},{"$f":"IF(NOT(ISBLANK(テーブル635[[#This Row],[機械器具設置]])),VLOOKUP(テーブル635[[#This Row],[機械器具設置]],塗装[],2,TRUE), IF(NOT(ISBLANK(テーブル635[[#This Row],[許可区分（機械器具）]])),\"D\",\"-\"))","v":"A"},{"$f":"IF(NOT(ISBLANK(テーブル635[[#This Row],[電気通信]])),VLOOKUP(テーブル635[[#This Row],[電気通信]],電気[],2,TRUE), IF(NOT(ISBLANK(テーブル635[[#This Row],[許可区分(電気)]])),\"D\",\"-\"))","v":"-"},{"$f":"IF(NOT(ISBLANK(テーブル635[[#This Row],[水道施設]])),VLOOKUP(テーブル635[[#This Row],[水道施設]],水道[],2,TRUE), IF(NOT(ISBLANK(テーブル635[[#This Row],[許可区分（水道施設）]])),\"D\",\"-\"))","v":"A"}]
[16,"県外","㈱ウォーターテック　東日本支店","東京都港区芝浦3-16-1","大隅　昌平","03-3456-0795","03-3456-0646","特定",714,null,null,"特定",772,"特定",729,null,null,null,null,null,null,"特定",1003,null,null,"特定",1101,{"$f":"IF(NOT(ISBLANK(テーブル635[[#This Row],[土木一式]])),VLOOKUP(テーブル635[[#This Row],[土木一式]],土木[],2,TRUE), IF(NOT(ISBLANK(テーブル635[[#This Row],[許可区分(土木)]])),\"D\",\"-\"))","v":"B"},{"$f":"IF(NOT(ISBLANK(テーブル635[[#This Row],[建築一式]])),VLOOKUP(テーブル635[[#This Row],[建築一式]],建築[],2,TRUE), IF(NOT(ISBLANK(テーブル635[[#This Row],[許可区分（建築）]])),\"D\",\"-\"))","v":"-"},{"$f":"IF(NOT(ISBLANK(テーブル635[[#This Row],[電気]])),VLOOKUP(テーブル635[[#This Row],[電気]],電気[],2,TRUE), IF(NOT(ISBLANK(テーブル635[[#This Row],[許可区分（電気）]])),\"D\",\"-\"))","v":"B"},{"$f":"IF(NOT(ISBLANK(テーブル635[[#This Row],[管]])),VLOOKUP(テーブル635[[#This Row],[管]],管[],2,TRUE), IF(NOT(ISBLANK(テーブル635[[#This Row],[許可区分（管）]])),\"D\",\"-\"))","v":"A"},{"$f":"IF(NOT(ISBLANK(テーブル635[[#This Row],[ほ装]])),VLOOKUP(テーブル635[[#This Row],[ほ装]],ほ装[],2,TRUE), IF(NOT(ISBLANK(テーブル635[[#This Row],[許可区分(ほ装)]])),\"D\",\"-\"))","v":"-"},{"$f":"IF(NOT(ISBLANK(テーブル635[[#This Row],[塗装]])),VLOOKUP(テーブル635[[#This Row],[塗装]],塗装[],2,TRUE), IF(NOT(ISBLANK(テーブル635[[#This Row],[許可区分（塗装）]])),\"D\",\"-\"))","v":"-"},{"$f":"IF(NOT(ISBLANK(テーブル635[[#This Row],[防水]])),VLOOKUP(テーブル635[[#This Row],[防水]],塗装[],2,TRUE), IF(NOT(ISBLANK(テーブル635[[#This Row],[許可区分（防水）]])),\"D\",\"-\"))","v":"-"},{"$f":"IF(NOT(ISBLANK(テーブル635[[#This Row],[機械器具設置]])),VLOOKUP(テーブル635[[#This Row],[機械器具設置]],塗装[],2,TRUE), IF(NOT(ISBLANK(テーブル635[[#This Row],[許可区分（機械器具）]])),\"D\",\"-\"))","v":"A"},{"$f":"IF(NOT(ISBLANK(テーブル635[[#This Row],[電気通信]])),VLOOKUP(テーブル635[[#This Row],[電気通信]],電気[],2,TRUE), IF(NOT(ISBLANK(テーブル635[[#This Row],[許可区分(電気)]])),\"D\",\"-\"))","v":"-"},{"$f":"IF(NOT(ISBLANK(テーブル635[[#This Row],[水道施設]])),VLOOKUP(テーブル635[[#This Row],[水道施設]],水道[],2,TRUE), IF(NOT(ISBLANK(テーブル635[[#This Row],[許可区分（水道施設）]])),\"D\",\"-\"))","v":"A"}]
[17,"県外","㈱西原環境　関東支店","東京都港区海岸三丁目20番20号","小仁　祐","03-3455-4448","03-3455-4404","特定",881,null,null,"特定",1021,"特定",1116,null,null,null,null,null,null,"特定",1155,null,null,"特定",1200,{"$f":"IF(NOT(ISBLANK(テーブル635[[#This Row],[土木一式]])),VLOOKUP(テーブル635[[#This Row],[土木一式]],土木[],2,TRUE), IF(NOT(ISBLANK(テーブル635[[#This Row],[許可区分(土木)]])),\"D\",\"-\"))","v":"A"},{"$f":"IF(NOT(ISBLANK(テーブル635[[#This Row],[建築一式]])),VLOOKUP(テーブル635[[#This Row],[建築一式]],建築[],2,TRUE), IF(NOT(ISBLANK(テーブル635[[#This Row],[許可区分（建築）]])),\"D\",\"-\"))","v":"-"},{"$f":"IF(NOT(ISBLANK(テーブル635[[#This Row],[電気]])),VLOOKUP(テーブル635[[#This Row],[電気]],電気[],2,TRUE), IF(NOT(ISBLANK(テーブル635[[#This Row],[許可区分（電気）]])),\"D\",\"-\"))","v":"A"},{"$f":"IF(NOT(ISBLANK(テーブル635[[#This Row],[管]])),VLOOKUP(テーブル635[[#This Row],[管]],管[],2,TRUE), IF(NOT(ISBLANK(テーブル635[[#This Row],[許可区分（管）]])),\"D\",\"-\"))","v":"A"},{"$f":"IF(NOT(ISBLANK(テーブル635[[#This Row],[ほ装]])),VLOOKUP(テーブル635[[#This Row],[ほ装]],ほ装[],2,TRUE), IF(NOT(ISBLANK(テーブル635[[#This Row],[許可区分(ほ装)]])),\"D\",\"-\"))","v":"-"},{"$f":"IF(NOT(ISBLANK(テーブル635[[#This Row],[塗装]])),VLOOKUP(テーブル635[[#This Row],[塗装]],塗装[],2,TRUE), IF(NOT(ISBLANK(テーブル635[[#This Row],[許可区分（塗装）]])),\"D\",\"-\"))","v":"-"},{"$f":"IF(NOT(ISBLANK(テーブル635[[#This Row],[防水]])),VLOOKUP(テーブル635[[#This Row],[防水]],塗装[],2,TRUE), IF(NOT(ISBLANK(テーブル635[[#This Row],[許可区分（防水）]])),\"D\",\"-\"))","v":"-"},{"$f":"IF(NOT(ISBLANK(テーブル635[[#This Row],[機械器具設置]])),VLOOKUP(テーブル635[[#This Row],[機械器具設置]],塗装[],2,TRUE), IF(NOT(ISBLANK(テーブル635[[#This Row],[許可区分（機械器具）]])),\"D\",\"-\"))","v":"A"},{"$f":"IF(NOT(ISBLANK(テーブル635[[#This Row],[電気通信]])),VLOOKUP(テーブル635[[#This Row],[電気通信]],電気[],2,TRUE), IF(NOT(ISBLANK(テーブル635[[#This Row],[許可区分(電気)]])),\"D\",\"-\"))","v":"-"},{"$f":"IF(NOT(ISBLANK(テーブル635[[#This Row],[水道施設]])),VLOOKUP(テーブル635[[#This Row],[水道施設]],水道[],2,TRUE), IF(NOT(ISBLANK(テーブル635[[#This Row],[許可区分（水道施設）]])),\"D\",\"-\"))","v":"A"}]
[18,"県外","アズビル㈱　ｱﾄﾞﾊﾞﾝｽｵｰﾄﾒｰｼｮﾝｶﾝﾊﾟﾆｰ東京支社","東京都品川区北品川5-5-15","五十嵐　貴志","03-6432-5140","03-3440-3163",null,null,null,null,"特定",1853,"特定",1651,null,null,null,null,null,null,null,null,"特定",1425,null,null,{"$f":"IF(NOT(ISBLANK(テーブル635[[#This Row],[土木一式]])),VLOOKUP(テーブル635[[#This Row],[土木一式]],土木[],2,TRUE), IF(NOT(ISBLANK(テーブル635[[#This Row],[許可区分(土木)]])),\"D\",\"-\"))","v":"-"},{"$f":"IF(NOT(ISBLANK(テーブル635[[#This Row],[建築一式]])),VLOOKUP(テーブル635[[#This Row],[建築一式]],建築[],2,TRUE), IF(NOT(ISBLANK(テーブル635[[#This Row],[許可区分（建築）]])),\"D\",\"-\"))","v":"-"},{"$f":"IF(NOT(ISBLANK(テーブル635[[#This Row],[電気]])),VLOOKUP(テーブル635[[#This Row],[電気]],電気[],2,TRUE), IF(NOT(ISBLANK(テーブル635[[#This Row],[許可区分（電気）]])),\"D\",\"-\"))","v":"A"},{"$f":"IF(NOT(ISBLANK(テーブル635[[#This Row],[管]])),VLOOKUP(テーブル635[[#This Row],[管]],管[],2,TRUE), IF(NOT(ISBLANK(テーブル635[[#This Row],[許可区分（管）]])),\"D\",\"-\"))","v":"A"},{"$f":"IF(NOT(ISBLANK(テーブル635[[#This Row],[ほ装]])),VLOOKUP(テーブル635[[#This Row],[ほ装]],ほ装[],2,TRUE), IF(NOT(ISBLANK(テーブル635[[#This Row],[許可区分(ほ装)]])),\"D\",\"-\"))","v":"-"},{"$f":"IF(NOT(ISBLANK(テーブル635[[#This Row],[塗装]])),VLOOKUP(テーブル635[[#This Row],[塗装]],塗装[],2,TRUE), IF(NOT(ISBLANK(テーブル635[[#This Row],[許可区分（塗装）]])),\"D\",\"-\"))","v":"-"},{"$f":"IF(NOT(ISBLANK(テーブル635[[#This Row],[防水]])),VLOOKUP(テーブル635[[#This Row],[防水]],塗装[],2,TRUE), IF(NOT(ISBLANK(テーブル635[[#This Row],[許可区分（防水）]])),\"D\",\"-\"))","v":"-"},{"$f":"IF(NOT(ISBLANK(テーブル635[[#This Row],[機械器具設置]])),VLOOKUP(テーブル635[[#This Row],[機械器具設置]],塗装[],2,TRUE), IF(NOT(ISBLANK(テーブル635[[#This Row],[許可区分（機械器具）]])),\"D\",\"-\"))","v":"-"},{"$f":"IF(NOT(ISBLANK(テーブル635[[#This Row],[電気通信]])),VLOOKUP(テーブル635[[#This Row],[電気通信]],電気[],2,TRUE), IF(NOT(ISBLANK(テーブル635[[#This Row],[許可区分(電気)]])),\"D\",\"-\"))","v":"A"},{"$f":"IF(NOT(ISBLANK(テーブル635[[#This Row],[水道施設]])),VLOOKUP(テーブル635[[#This Row],[水道施設]],水道[],2,TRUE), IF(NOT(ISBLANK(テーブル635[[#This Row],[許可区分（水道施設）]])),\"D\",\"-\"))","v":"-"}]
[19,"県外","三菱電機㈱　　社会システム第一部","東京都千代田区丸の内2-7-3","富岡　飛","03-3218-1482","03-3218-2893",null,null,null,null,"特定",1955,null,null,null,null,null,null,null,null,null,null,"特定",1634,null,null,{"$f":"IF(NOT(ISBLANK(テーブル635[[#This Row],[土木一式]])),VLOOKUP(テーブル635[[#This Row],[土木一式]],土木[],2,TRUE), IF(NOT(ISBLANK(テーブル635[[#This Row],[許可区分(土木)]])),\"D\",\"-\"))","v":"-"},{"$f":"IF(NOT(ISBLANK(テーブル635[[#This Row],[建築一式]])),VLOOKUP(テーブル635[[#This Row],[建築一式]],建築[],2,TRUE), IF(NOT(ISBLANK(テーブル635[[#This Row],[許可区分（建築）]])),\"D\",\"-\"))","v":"-"},{"$f":"IF(NOT(ISBLANK(テーブル635[[#This Row],[電気]])),VLOOKUP(テーブル635[[#This Row],[電気]],電気[],2,TRUE), IF(NOT(ISBLANK(テーブル635[[#This Row],[許可区分（電気）]])),\"D\",\"-\"))","v":"A"},{"$f":"IF(NOT(ISBLANK(テーブル635[[#This Row],[管]])),VLOOKUP(テーブル635[[#This Row],[管]],管[],2,TRUE), IF(NOT(ISBLANK(テーブル635[[#This Row],[許可区分（管）]])),\"D\",\"-\"))","v":"-"},{"$f":"IF(NOT(ISBLANK(テーブル635[[#This Row],[ほ装]])),VLOOKUP(テーブル635[[#This Row],[ほ装]],ほ装[],2,TRUE), IF(NOT(ISBLANK(テーブル635[[#This Row],[許可区分(ほ装)]])),\"D\",\"-\"))","v":"-"},{"$f":"IF(NOT(ISBLANK(テーブル635[[#This Row],[塗装]])),VLOOKUP(テーブル635[[#This Row],[塗装]],塗装[],2,TRUE), IF(NOT(ISBLANK(テーブル635[[#This Row],[許可区分（塗装）]])),\"D\",\"-\"))","v":"-"},{"$f":"IF(NOT(ISBLANK(テーブル635[[#This Row],[防水]])),VLOOKUP(テーブル635[[#This Row],[防水]],塗装[],2,TRUE), IF(NOT(ISBLANK(テーブル635[[#This Row],[許可区分（防水）]])),\"D\",\"-\"))","v":"-"},{"$f":"IF(NOT(ISBLANK(テーブル635[[#This Row],[機械器具設置]])),VLOOKUP(テーブル635[[#This Row],[機械器具設置]],塗装[],2,TRUE), IF(NOT(ISBLANK(テーブル635[[#This Row],[許可区分（機械器具）]])),\"D\",\"-\"))","v":"-"},{"$f":"IF(NOT(ISBLANK(テーブル635[[#This Row],[電気通信]])),VLOOKUP(テーブル635[[#This Row],[電気通信]],電気[],2,TRUE), IF(NOT(ISBLANK(テーブル635[[#This Row],[許可区分(電気)]])),\"D\",\"-\"))","v":"A"},{"$f":"IF(NOT(ISBLANK(テーブル635[[#This Row],[水道施設]])),VLOOKUP(テーブル635[[#This Row],[水道施設]],水道[],2,TRUE), IF(NOT(ISBLANK(テーブル635[[#This Row],[許可区分（水道施設）]])),\"D\",\"-\"))","v":"-"}]
[20,"県外","㈱清水合金製作所　","滋賀県彦根市東沼波町928","和田　正憲","0749-23-3131","0749-22-0687",null,null,null,null,null,null,null,null,null,null,null,null,null,null,"一般",814,null,null,"一般",751,{"$f":"IF(NOT(ISBLANK(テーブル635[[#This Row],[土木一式]])),VLOOKUP(テーブル635[[#This Row],[土木一式]],土木[],2,TRUE), IF(NOT(ISBLANK(テーブル635[[#This Row],[許可区分(土木)]])),\"D\",\"-\"))","v":"-"},{"$f":"IF(NOT(ISBLANK(テーブル635[[#This Row],[建築一式]])),VLOOKUP(テーブル635[[#This Row],[建築一式]],建築[],2,TRUE), IF(NOT(ISBLANK(テーブル635[[#This Row],[許可区分（建築）]])),\"D\",\"-\"))","v":"-"},{"$f":"IF(NOT(ISBLANK(テーブル635[[#This Row],[電気]])),VLOOKUP(テーブル635[[#This Row],[電気]],電気[],2,TRUE), IF(NOT(ISBLANK(テーブル635[[#This Row],[許可区分（電気）]])),\"D\",\"-\"))","v":"-"},{"$f":"IF(NOT(ISBLANK(テーブル635[[#This Row],[管]])),VLOOKUP(テーブル635[[#This Row],[管]],管[],2,TRUE), IF(NOT(ISBLANK(テーブル635[[#This Row],[許可区分（管）]])),\"D\",\"-\"))","v":"-"},{"$f":"IF(NOT(ISBLANK(テーブル635[[#This Row],[ほ装]])),VLOOKUP(テーブル635[[#This Row],[ほ装]],ほ装[],2,TRUE), IF(NOT(ISBLANK(テーブル635[[#This Row],[許可区分(ほ装)]])),\"D\",\"-\"))","v":"-"},{"$f":"IF(NOT(ISBLANK(テーブル635[[#This Row],[塗装]])),VLOOKUP(テーブル635[[#This Row],[塗装]],塗装[],2,TRUE), IF(NOT(ISBLANK(テーブル635[[#This Row],[許可区分（塗装）]])),\"D\",\"-\"))","v":"-"},{"$f":"IF(NOT(ISBLANK(テーブル635[[#This Row],[防水]])),VLOOKUP(テーブル635[[#This Row],[防水]],塗装[],2,TRUE), IF(NOT(ISBLANK(テーブル635[[#This Row],[許可区分（防水）]])),\"D\",\"-\"))","v":"-"},{"$f":"IF(NOT(ISBLANK(テーブル635[[#This Row],[機械器具設置]])),VLOOKUP(テーブル635[[#This Row],[機械器具設置]],塗装[],2,TRUE), IF(NOT(ISBLANK(テーブル635[[#This Row],[許可区分（機械器具）]])),\"D\",\"-\"))","v":"A"},{"$f":"IF(NOT(ISBLANK(テーブル635[[#This Row],[電気通信]])),VLOOKUP(テーブル635[[#This Row],[電気通信]],電気[],2,TRUE), IF(NOT(ISBLANK(テーブル635[[#This Row],[許可区分(電気)]])),\"D\",\"-\"))","v":"-"},{"$f":"IF(NOT(ISBLANK(テーブル635[[#This Row],[水道施設]])),VLOOKUP(テーブル635[[#This Row],[水道施設]],水道[],2,TRUE), IF(NOT(ISBLANK(テーブル635[[#This Row],[許可区分（水道施設）]])),\"D\",\"-\"))","v":"B"}]
[21,"県外","㈱荏原製作所　東京支社","東京都大田区羽田旭町11-1","井上　貴雄","050-3416-0123","03-3744-0187","特定",997,"特定",1009,"特定",1251,"特定",1383,"特定",1012,"特定",1081,null,null,"特定",1585,null,null,"特定",1305,{"$f":"IF(NOT(ISBLANK(テーブル635[[#This Row],[土木一式]])),VLOOKUP(テーブル635[[#This Row],[土木一式]],土木[],2,TRUE), IF(NOT(ISBLANK(テーブル635[[#This Row],[許可区分(土木)]])),\"D\",\"-\"))","v":"A"},{"$f":"IF(NOT(ISBLANK(テーブル635[[#This Row],[建築一式]])),VLOOKUP(テーブル635[[#This Row],[建築一式]],建築[],2,TRUE), IF(NOT(ISBLANK(テーブル635[[#This Row],[許可区分（建築）]])),\"D\",\"-\"))","v":"A"},{"$f":"IF(NOT(ISBLANK(テーブル635[[#This Row],[電気]])),VLOOKUP(テーブル635[[#This Row],[電気]],電気[],2,TRUE), IF(NOT(ISBLANK(テーブル635[[#This Row],[許可区分（電気）]])),\"D\",\"-\"))","v":"A"},{"$f":"IF(NOT(ISBLANK(テーブル635[[#This Row],[管]])),VLOOKUP(テーブル635[[#This Row],[管]],管[],2,TRUE), IF(NOT(ISBLANK(テーブル635[[#This Row],[許可区分（管）]])),\"D\",\"-\"))","v":"A"},{"$f":"IF(NOT(ISBLANK(テーブル635[[#This Row],[ほ装]])),VLOOKUP(テーブル635[[#This Row],[ほ装]],ほ装[],2,TRUE), IF(NOT(ISBLANK(テーブル635[[#This Row],[許可区分(ほ装)]])),\"D\",\"-\"))","v":"A"},{"$f":"IF(NOT(ISBLANK(テーブル635[[#This Row],[塗装]])),VLOOKUP(テーブル635[[#This Row],[塗装]],塗装[],2,TRUE), IF(NOT(ISBLANK(テーブル635[[#This Row],[許可区分（塗装）]])),\"D\",\"-\"))","v":"A"},{"$f":"IF(NOT(ISBLANK(テーブル635[[#This Row],[防水]])),VLOOKUP(テーブル635[[#This Row],[防水]],塗装[],2,TRUE), IF(NOT(ISBLANK(テーブル635[[#This Row],[許可区分（防水）]])),\"D\",\"-\"))","v":"-"},{"$f":"IF(NOT(ISBLANK(テーブル635[[#This Row],[機械器具設置]])),VLOOKUP(テーブル635[[#This Row],[機械器具設置]],塗装[],2,TRUE), IF(NOT(ISBLANK(テーブル635[[#This Row],[許可区分（機械器具）]])),\"D\",\"-\"))","v":"A"},{"$f":"IF(NOT(ISBLANK(テーブル635[[#This Row],[電気通信]])),VLOOKUP(テーブル635[[#This Row],[電気通信]],電気[],2,TRUE), IF(NOT(ISBLANK(テーブル635[[#This Row],[許可区分(電気)]])),\"D\",\"-\"))","v":"-"},{"$f":"IF(NOT(ISBLANK(テーブル635[[#This Row],[水道施設]])),VLOOKUP(テーブル635[[#This Row],[水道施設]],水道[],2,TRUE), IF(NOT(ISBLANK(テーブル635[[#This Row],[許可区分（水道施設）]])),\"D\",\"-\"))","v":"A"}]
[22,"県外","JFEエンジニアリング㈱","神奈川県横浜市鶴見区末広町2-1","大下　元","045-505-8901","045-505-7362",null,null,null,null,"特定",1523,null,null,null,null,null,null,null,null,"特定",1778,null,null,"特定",1572,{"$f":"IF(NOT(ISBLANK(テーブル635[[#This Row],[土木一式]])),VLOOKUP(テーブル635[[#This Row],[土木一式]],土木[],2,TRUE), IF(NOT(ISBLANK(テーブル635[[#This Row],[許可区分(土木)]])),\"D\",\"-\"))","v":"-"},{"$f":"IF(NOT(ISBLANK(テーブル635[[#This Row],[建築一式]])),VLOOKUP(テーブル635[[#This Row],[建築一式]],建築[],2,TRUE), IF(NOT(ISBLANK(テーブル635[[#This Row],[許可区分（建築）]])),\"D\",\"-\"))","v":"-"},{"$f":"IF(NOT(ISBLANK(テーブル635[[#This Row],[電気]])),VLOOKUP(テーブル635[[#This Row],[電気]],電気[],2,TRUE), IF(NOT(ISBLANK(テーブル635[[#This Row],[許可区分（電気）]])),\"D\",\"-\"))","v":"A"},{"$f":"IF(NOT(ISBLANK(テーブル635[[#This Row],[管]])),VLOOKUP(テーブル635[[#This Row],[管]],管[],2,TRUE), IF(NOT(ISBLANK(テーブル635[[#This Row],[許可区分（管）]])),\"D\",\"-\"))","v":"-"},{"$f":"IF(NOT(ISBLANK(テーブル635[[#This Row],[ほ装]])),VLOOKUP(テーブル635[[#This Row],[ほ装]],ほ装[],2,TRUE), IF(NOT(ISBLANK(テーブル635[[#This Row],[許可区分(ほ装)]])),\"D\",\"-\"))","v":"-"},{"$f":"IF(NOT(ISBLANK(テーブル635[[#This Row],[塗装]])),VLOOKUP(テーブル635[[#This Row],[塗装]],塗装[],2,TRUE), IF(NOT(ISBLANK(テーブル635[[#This Row],[許可区分（塗装）]])),\"D\",\"-\"))","v":"-"},{"$f":"IF(NOT(ISBLANK(テーブル635[[#This Row],[防水]])),VLOOKUP(テーブル635[[#This Row],[防水]],塗装[],2,TRUE), IF(NOT(ISBLANK(テーブル635[[#This Row],[許可区分（防水）]])),\"D\",\"-\"))","v":"-"},{"$f":"IF(NOT(ISBLANK(テーブル635[[#This Row],[機械器具設置]])),VLOOKUP(テーブル635[[#This Row],[機械器具設置]],塗装[],2,TRUE), IF(NOT(ISBLANK(テーブル635[[#This Row],[許可区分（機械器具）]])),\"D\",\"-\"))","v":"A"},{"$f":"IF(NOT(ISBLANK(テーブル635[[#This Row],[電気通信]])),VLOOKUP(テーブル635[[#This Row],[電気通信]],電気[],2,TRUE), IF(NOT(ISBLANK(テーブル635[[#This Row],[許可区分(電気)]])),\"D\",\"-\"))","v":"-"},{"$f":"IF(NOT(ISBLANK(テーブル635[[#This Row],[水道施設]])),VLOOKUP(テーブル635[[#This Row],[水道施設]],水道[],2,TRUE), IF(NOT(ISBLANK(テーブル635[[#This Row],[許可区分（水道施設）]])),\"D\",\"-\"))","v":"A"}]
[23,"県外","愛知時計電機㈱　千葉営業所","東京都江戸川区西瑞江5-5-4","三島　康","03-5658-1320","03-5658-1324",null,null,null,null,"特定",1342,"一般",1208,null,null,null,null,null,null,"一般",1101,"一般",1227,null,null,{"$f":"IF(NOT(ISBLANK(テーブル635[[#This Row],[土木一式]])),VLOOKUP(テーブル635[[#This Row],[土木一式]],土木[],2,TRUE), IF(NOT(ISBLANK(テーブル635[[#This Row],[許可区分(土木)]])),\"D\",\"-\"))","v":"-"},{"$f":"IF(NOT(ISBLANK(テーブル635[[#This Row],[建築一式]])),VLOOKUP(テーブル635[[#This Row],[建築一式]],建築[],2,TRUE), IF(NOT(ISBLANK(テーブル635[[#This Row],[許可区分（建築）]])),\"D\",\"-\"))","v":"-"},{"$f":"IF(NOT(ISBLANK(テーブル635[[#This Row],[電気]])),VLOOKUP(テーブル635[[#This Row],[電気]],電気[],2,TRUE), IF(NOT(ISBLANK(テーブル635[[#This Row],[許可区分（電気）]])),\"D\",\"-\"))","v":"A"},{"$f":"IF(NOT(ISBLANK(テーブル635[[#This Row],[管]])),VLOOKUP(テーブル635[[#This Row],[管]],管[],2,TRUE), IF(NOT(ISBLANK(テーブル635[[#This Row],[許可区分（管）]])),\"D\",\"-\"))","v":"A"},{"$f":"IF(NOT(ISBLANK(テーブル635[[#This Row],[ほ装]])),VLOOKUP(テーブル635[[#This Row],[ほ装]],ほ装[],2,TRUE), IF(NOT(ISBLANK(テーブル635[[#This Row],[許可区分(ほ装)]])),\"D\",\"-\"))","v":"-"},{"$f":"IF(NOT(ISBLANK(テーブル635[[#This Row],[塗装]])),VLOOKUP(テーブル635[[#This Row],[塗装]],塗装[],2,TRUE), IF(NOT(ISBLANK(テーブル635[[#This Row],[許可区分（塗装）]])),\"D\",\"-\"))","v":"-"},{"$f":"IF(NOT(ISBLANK(テーブル635[[#This Row],[防水]])),VLOOKUP(テーブル635[[#This Row],[防水]],塗装[],2,TRUE), IF(NOT(ISBLANK(テーブル635[[#This Row],[許可区分（防水）]])),\"D\",\"-\"))","v":"-"},{"$f":"IF(NOT(ISBLANK(テーブル635[[#This Row],[機械器具設置]])),VLOOKUP(テーブル635[[#This Row],[機械器具設置]],塗装[],2,TRUE), IF(NOT(ISBLANK(テーブル635[[#This Row],[許可区分（機械器具）]])),\"D\",\"-\"))","v":"A"},{"$f":"IF(NOT(ISBLANK(テーブル635[[#This Row],[電気通信]])),VLOOKUP(テーブル635[[#This Row],[電気通信]],電気[],2,TRUE), IF(NOT(ISBLANK(テーブル635[[#This Row],[許可区分(電気)]])),\"D\",\"-\"))","v":"A"},{"$f":"IF(NOT(ISBLANK(テーブル635[[#This Row],[水道施設]])),VLOOKUP(テーブル635[[#This Row],[水道施設]],水道[],2,TRUE), IF(NOT(ISBLANK(テーブル635[[#This Row],[許可区分（水道施設）]])),\"D\",\"-\"))","v":"-"}]
[24,"県外","㈱オーエンス","東京都中央区銀座4-12-15","大木　一雄","03-3544-1551","03-3544-1560",null,null,"特定",679,"特定",859,"特定",843,null,null,null,null,null,null,null,null,null,null,null,null,{"$f":"IF(NOT(ISBLANK(テーブル635[[#This Row],[土木一式]])),VLOOKUP(テーブル635[[#This Row],[土木一式]],土木[],2,TRUE), IF(NOT(ISBLANK(テーブル635[[#This Row],[許可区分(土木)]])),\"D\",\"-\"))","v":"-"},{"$f":"IF(NOT(ISBLANK(テーブル635[[#This Row],[建築一式]])),VLOOKUP(テーブル635[[#This Row],[建築一式]],建築[],2,TRUE), IF(NOT(ISBLANK(テーブル635[[#This Row],[許可区分（建築）]])),\"D\",\"-\"))","v":"C"},{"$f":"IF(NOT(ISBLANK(テーブル635[[#This Row],[電気]])),VLOOKUP(テーブル635[[#This Row],[電気]],電気[],2,TRUE), IF(NOT(ISBLANK(テーブル635[[#This Row],[許可区分（電気）]])),\"D\",\"-\"))","v":"A"},{"$f":"IF(NOT(ISBLANK(テーブル635[[#This Row],[管]])),VLOOKUP(テーブル635[[#This Row],[管]],管[],2,TRUE), IF(NOT(ISBLANK(テーブル635[[#This Row],[許可区分（管）]])),\"D\",\"-\"))","v":"A"},{"$f":"IF(NOT(ISBLANK(テーブル635[[#This Row],[ほ装]])),VLOOKUP(テーブル635[[#This Row],[ほ装]],ほ装[],2,TRUE), IF(NOT(ISBLANK(テーブル635[[#This Row],[許可区分(ほ装)]])),\"D\",\"-\"))","v":"-"},{"$f":"IF(NOT(ISBLANK(テーブル635[[#This Row],[塗装]])),VLOOKUP(テーブル635[[#This Row],[塗装]],塗装[],2,TRUE), IF(NOT(ISBLANK(テーブル635[[#This Row],[許可区分（塗装）]])),\"D\",\"-\"))","v":"-"},{"$f":"IF(NOT(ISBLANK(テーブル635[[#This Row],[防水]])),VLOOKUP(テーブル635[[#This Row],[防水]],塗装[],2,TRUE), IF(NOT(ISBLANK(テーブル635[[#This Row],[許可区分（防水）]])),\"D\",\"-\"))","v":"-"},{"$f":"IF(NOT(ISBLANK(テーブル635[[#This Row],[機械器具設置]])),VLOOKUP(テーブル635[[#This Row],[機械器具設置]],塗装[],2,TRUE), IF(NOT(ISBLANK(テーブル635[[#This Row],[許可区分（機械器具）]])),\"D\",\"-\"))","v":"-"},{"$f":"IF(NOT(ISBLANK(テーブル635[[#This Row],[電気通信]])),VLOOKUP(テーブル635[[#This Row],[電気通信]],電気[],2,TRUE), IF(NOT(ISBLANK(テーブル635[[#This Row],[許可区分(電気)]])),\"D\",\"-\"))","v":"-"},{"$f":"IF(NOT(ISBLANK(テーブル635[[#This Row],[水道施設]])),VLOOKUP(テーブル635[[#This Row],[水道施設]],水道[],2,TRUE), IF(NOT(ISBLANK(テーブル635[[#This Row],[許可区分（水道施設）]])),\"D\",\"-\"))","v":"-"}]
[25,"県外","シンク・エンジニアリング㈱","東京都目黒区自由が丘3-16-15","岡村　勝也","03-3724-7201","03-3724-7203",null,null,null,null,"特定",1066,null,null,null,null,null,null,null,null,"一般",791,"特定",962,null,null,{"$f":"IF(NOT(ISBLANK(テーブル635[[#This Row],[土木一式]])),VLOOKUP(テーブル635[[#This Row],[土木一式]],土木[],2,TRUE), IF(NOT(ISBLANK(テーブル635[[#This Row],[許可区分(土木)]])),\"D\",\"-\"))","v":"-"},{"$f":"IF(NOT(ISBLANK(テーブル635[[#This Row],[建築一式]])),VLOOKUP(テーブル635[[#This Row],[建築一式]],建築[],2,TRUE), IF(NOT(ISBLANK(テーブル635[[#This Row],[許可区分（建築）]])),\"D\",\"-\"))","v":"-"},{"$f":"IF(NOT(ISBLANK(テーブル635[[#This Row],[電気]])),VLOOKUP(テーブル635[[#This Row],[電気]],電気[],2,TRUE), IF(NOT(ISBLANK(テーブル635[[#This Row],[許可区分（電気）]])),\"D\",\"-\"))","v":"A"},{"$f":"IF(NOT(ISBLANK(テーブル635[[#This Row],[管]])),VLOOKUP(テーブル635[[#This Row],[管]],管[],2,TRUE), IF(NOT(ISBLANK(テーブル635[[#This Row],[許可区分（管）]])),\"D\",\"-\"))","v":"-"},{"$f":"IF(NOT(ISBLANK(テーブル635[[#This Row],[ほ装]])),VLOOKUP(テーブル635[[#This Row],[ほ装]],ほ装[],2,TRUE), IF(NOT(ISBLANK(テーブル635[[#This Row],[許可区分(ほ装)]])),\"D\",\"-\"))","v":"-"},{"$f":"IF(NOT(ISBLANK(テーブル635[[#This Row],[塗装]])),VLOOKUP(テーブル635[[#This Row],[塗装]],塗装[],2,TRUE), IF(NOT(ISBLANK(テーブル635[[#This Row],[許可区分（塗装）]])),\"D\",\"-\"))","v":"-"},{"$f":"IF(NOT(ISBLANK(テーブル635[[#This Row],[防水]])),VLOOKUP(テーブル635[[#This Row],[防水]],塗装[],2,TRUE), IF(NOT(ISBLANK(テーブル635[[#This Row],[許可区分（防水）]])),\"D\",\"-\"))","v":"-"},{"$f":"IF(NOT(ISBLANK(テーブル635[[#This Row],[機械器具設置]])),VLOOKUP(テーブル635[[#This Row],[機械器具設置]],塗装[],2,TRUE), IF(NOT(ISBLANK(テーブル635[[#This Row],[許可区分（機械器具）]])),\"D\",\"-\"))","v":"B"},{"$f":"IF(NOT(ISBLANK(テーブル635[[#This Row],[電気通信]])),VLOOKUP(テーブル635[[#This Row],[電気通信]],電気[],2,TRUE), IF(NOT(ISBLANK(テーブル635[[#This Row],[許可区分(電気)]])),\"D\",\"-\"))","v":"A"},{"$f":"IF(NOT(ISBLANK(テーブル635[[#This Row],[水道施設]])),VLOOKUP(テーブル635[[#This Row],[水道施設]],水道[],2,TRUE), IF(NOT(ISBLANK(テーブル635[[#This Row],[許可区分（水道施設）]])),\"D\",\"-\"))","v":"-"}]
[26,"県外","ヤンマーエネルギーシステム㈱　東京支社","東京都千代田区外神田4-14-1","尾形　宏仲","03-6733-4220","03-6733-4221",null,null,null,null,"特定",1346,"特定",1239,null,null,null,null,null,null,"一般",1242,null,null,null,null,{"$f":"IF(NOT(ISBLANK(テーブル635[[#This Row],[土木一式]])),VLOOKUP(テーブル635[[#This Row],[土木一式]],土木[],2,TRUE), IF(NOT(ISBLANK(テーブル635[[#This Row],[許可区分(土木)]])),\"D\",\"-\"))","v":"-"},{"$f":"IF(NOT(ISBLANK(テーブル635[[#This Row],[建築一式]])),VLOOKUP(テーブル635[[#This Row],[建築一式]],建築[],2,TRUE), IF(NOT(ISBLANK(テーブル635[[#This Row],[許可区分（建築）]])),\"D\",\"-\"))","v":"-"},{"$f":"IF(NOT(ISBLANK(テーブル635[[#This Row],[電気]])),VLOOKUP(テーブル635[[#This Row],[電気]],電気[],2,TRUE), IF(NOT(ISBLANK(テーブル635[[#This Row],[許可区分（電気）]])),\"D\",\"-\"))","v":"A"},{"$f":"IF(NOT(ISBLANK(テーブル635[[#This Row],[管]])),VLOOKUP(テーブル635[[#This Row],[管]],管[],2,TRUE), IF(NOT(ISBLANK(テーブル635[[#This Row],[許可区分（管）]])),\"D\",\"-\"))","v":"A"},{"$f":"IF(NOT(ISBLANK(テーブル635[[#This Row],[ほ装]])),VLOOKUP(テーブル635[[#This Row],[ほ装]],ほ装[],2,TRUE), IF(NOT(ISBLANK(テーブル635[[#This Row],[許可区分(ほ装)]])),\"D\",\"-\"))","v":"-"},{"$f":"IF(NOT(ISBLANK(テーブル635[[#This Row],[塗装]])),VLOOKUP(テーブル635[[#This Row],[塗装]],塗装[],2,TRUE), IF(NOT(ISBLANK(テーブル635[[#This Row],[許可区分（塗装）]])),\"D\",\"-\"))","v":"-"},{"$f":"IF(NOT(ISBLANK(テーブル635[[#This Row],[防水]])),VLOOKUP(テーブル635[[#This Row],[防水]],塗装[],2,TRUE), IF(NOT(ISBLANK(テーブル635[[#This Row],[許可区分（防水）]])),\"D\",\"-\"))","v":"-"},{"$f":"IF(NOT(ISBLANK(テーブル635[[#This Row],[機械器具設置]])),VLOOKUP(テーブル635[[#This Row],[機械器具設置]],塗装[],2,TRUE), IF(NOT(ISBLANK(テーブル635[[#This Row],[許可区分（機械器具）]])),\"D\",\"-\"))","v":"A"},{"$f":"IF(NOT(ISBLANK(テーブル635[[#This Row],[電気通信]])),VLOOKUP(テーブル635[[#This Row],[電気通信]],電気[],2,TRUE), IF(NOT(ISBLANK(テーブル635[[#This Row],[許可区分(電気)]])),\"D\",\"-\"))","v":"-"},{"$f":"IF(NOT(ISBLANK(テーブル635[[#This Row],[水道施設]])),VLOOKUP(テーブル635[[#This Row],[水道施設]],水道[],2,TRUE), IF(NOT(ISBLANK(テーブル635[[#This Row],[許可区分（水道施設）]])),\"D\",\"-\"))","v":"-"}]
[27,"県外","㈱正興電機製作所　東京営業所","東京都千代田区東神田2-5-12","青木　正尚","03-5835-1015","03-5835-1016",null,null,null,null,"特定",1329,null,null,null,null,null,null,null,null,null,null,"特定",1066,null,null,{"$f":"IF(NOT(ISBLANK(テーブル635[[#This Row],[土木一式]])),VLOOKUP(テーブル635[[#This Row],[土木一式]],土木[],2,TRUE), IF(NOT(ISBLANK(テーブル635[[#This Row],[許可区分(土木)]])),\"D\",\"-\"))","v":"-"},{"$f":"IF(NOT(ISBLANK(テーブル635[[#This Row],[建築一式]])),VLOOKUP(テーブル635[[#This Row],[建築一式]],建築[],2,TRUE), IF(NOT(ISBLANK(テーブル635[[#This Row],[許可区分（建築）]])),\"D\",\"-\"))","v":"-"},{"$f":"IF(NOT(ISBLANK(テーブル635[[#This Row],[電気]])),VLOOKUP(テーブル635[[#This Row],[電気]],電気[],2,TRUE), IF(NOT(ISBLANK(テーブル635[[#This Row],[許可区分（電気）]])),\"D\",\"-\"))","v":"A"},{"$f":"IF(NOT(ISBLANK(テーブル635[[#This Row],[管]])),VLOOKUP(テーブル635[[#This Row],[管]],管[],2,TRUE), IF(NOT(ISBLANK(テーブル635[[#This Row],[許可区分（管）]])),\"D\",\"-\"))","v":"-"},{"$f":"IF(NOT(ISBLANK(テーブル635[[#This Row],[ほ装]])),VLOOKUP(テーブル635[[#This Row],[ほ装]],ほ装[],2,TRUE), IF(NOT(ISBLANK(テーブル635[[#This Row],[許可区分(ほ装)]])),\"D\",\"-\"))","v":"-"},{"$f":"IF(NOT(ISBLANK(テーブル635[[#This Row],[塗装]])),VLOOKUP(テーブル635[[#This Row],[塗装]],塗装[],2,TRUE), IF(NOT(ISBLANK(テーブル635[[#This Row],[許可区分（塗装）]])),\"D\",\"-\"))","v":"-"},{"$f":"IF(NOT(ISBLANK(テーブル635[[#This Row],[防水]])),VLOOKUP(テーブル635[[#This Row],[防水]],塗装[],2,TRUE), IF(NOT(ISBLANK(テーブル635[[#This Row],[許可区分（防水）]])),\"D\",\"-\"))","v":"-"},{"$f":"IF(NOT(ISBLANK(テーブル635[[#This Row],[機械器具設置]])),VLOOKUP(テーブル635[[#This Row],[機械器具設置]],塗装[],2,TRUE), IF(NOT(ISBLANK(テーブル635[[#This Row],[許可区分（機械器具）]])),\"D\",\"-\"))","v":"-"},{"$f":"IF(NOT(ISBLANK(テーブル635[[#This Row],[電気通信]])),VLOOKUP(テーブル635[[#This Row],[電気通信]],電気[],2,TRUE), IF(NOT(ISBLANK(テーブル635[[#This Row],[許可区分(電気)]])),\"D\",\"-\"))","v":"A"},{"$f":"IF(NOT(ISBLANK(テーブル635[[#This Row],[水道施設]])),VLOOKUP(テーブル635[[#This Row],[水道施設]],水道[],2,TRUE), IF(NOT(ISBLANK(テーブル635[[#This Row],[許可区分（水道施設）]])),\"D\",\"-\"))","v":"-"}]
[28,"県外","㈱神鋼環境ソリューション　東京支社","東京都品川区西品川1-1-1","三野　淳一","03-5931-3714","03-5931-5706",null,null,null,null,null,null,null,null,null,null,null,null,null,null,"特定",1424,null,null,null,null,{"$f":"IF(NOT(ISBLANK(テーブル635[[#This Row],[土木一式]])),VLOOKUP(テーブル635[[#This Row],[土木一式]],土木[],2,TRUE), IF(NOT(ISBLANK(テーブル635[[#This Row],[許可区分(土木)]])),\"D\",\"-\"))","v":"-"},{"$f":"IF(NOT(ISBLANK(テーブル635[[#This Row],[建築一式]])),VLOOKUP(テーブル635[[#This Row],[建築一式]],建築[],2,TRUE), IF(NOT(ISBLANK(テーブル635[[#This Row],[許可区分（建築）]])),\"D\",\"-\"))","v":"-"},{"$f":"IF(NOT(ISBLANK(テーブル635[[#This Row],[電気]])),VLOOKUP(テーブル635[[#This Row],[電気]],電気[],2,TRUE), IF(NOT(ISBLANK(テーブル635[[#This Row],[許可区分（電気）]])),\"D\",\"-\"))","v":"-"},{"$f":"IF(NOT(ISBLANK(テーブル635[[#This Row],[管]])),VLOOKUP(テーブル635[[#This Row],[管]],管[],2,TRUE), IF(NOT(ISBLANK(テーブル635[[#This Row],[許可区分（管）]])),\"D\",\"-\"))","v":"-"},{"$f":"IF(NOT(ISBLANK(テーブル635[[#This Row],[ほ装]])),VLOOKUP(テーブル635[[#This Row],[ほ装]],ほ装[],2,TRUE), IF(NOT(ISBLANK(テーブル635[[#This Row],[許可区分(ほ装)]])),\"D\",\"-\"))","v":"-"},{"$f":"IF(NOT(ISBLANK(テーブル635[[#This Row],[塗装]])),VLOOKUP(テーブル635[[#This Row],[塗装]],塗装[],2,TRUE), IF(NOT(ISBLANK(テーブル635[[#This Row],[許可区分（塗装）]])),\"D\",\"-\"))","v":"-"},{"$f":"IF(NOT(ISBLANK(テーブル635[[#This Row],[防水]])),VLOOKUP(テーブル635[[#This Row],[防水]],塗装[],2,TRUE), IF(NOT(ISBLANK(テーブル635[[#This Row],[許可区分（防水）]])),\"D\",\"-\"))","v":"-"},{"$f":"IF(NOT(ISBLANK(テーブル635[[#This Row],[機械器具設置]])),VLOOKUP(テーブル635[[#This Row],[機械器具設置]],塗装[],2,TRUE), IF(NOT(ISBLANK(テーブル635[[#This Row],[許可区分（機械器具）]])),\"D\",\"-\"))","v":"A"},{"$f":"IF(NOT(ISBLANK(テーブル635[[#This Row],[電気通信]])),VLOOKUP(テーブル635[[#This Row],[電気通信]],電気[],2,TRUE), IF(NOT(ISBLANK(テーブル635[[#This Row],[許可区分(電気)]])),\"D\",\"-\"))","v":"-"},{"$f":"IF(NOT(ISBLANK(テーブル635[[#This Row],[水道施設]])),VLOOKUP(テーブル635[[#This Row],[水道施設]],水道[],2,TRUE), IF(NOT(ISBLANK(テーブル635[[#This Row],[許可区分（水道施設）]])),\"D\",\"-\"))","v":"-"}]
[29,"県外","フジテコム㈱","東京都千代田区神田佐久間町2-20","森山　慎一","03-3862-3196","03-3866-1979",null,null,null,null,null,null,null,null,null,null,null,null,null,null,null,null,"一般",696,null,null,{"$f":"IF(NOT(ISBLANK(テーブル635[[#This Row],[土木一式]])),VLOOKUP(テーブル635[[#This Row],[土木一式]],土木[],2,TRUE), IF(NOT(ISBLANK(テーブル635[[#This Row],[許可区分(土木)]])),\"D\",\"-\"))","v":"-"},{"$f":"IF(NOT(ISBLANK(テーブル635[[#This Row],[建築一式]])),VLOOKUP(テーブル635[[#This Row],[建築一式]],建築[],2,TRUE), IF(NOT(ISBLANK(テーブル635[[#This Row],[許可区分（建築）]])),\"D\",\"-\"))","v":"-"},{"$f":"IF(NOT(ISBLANK(テーブル635[[#This Row],[電気]])),VLOOKUP(テーブル635[[#This Row],[電気]],電気[],2,TRUE), IF(NOT(ISBLANK(テーブル635[[#This Row],[許可区分（電気）]])),\"D\",\"-\"))","v":"-"},{"$f":"IF(NOT(ISBLANK(テーブル635[[#This Row],[管]])),VLOOKUP(テーブル635[[#This Row],[管]],管[],2,TRUE), IF(NOT(ISBLANK(テーブル635[[#This Row],[許可区分（管）]])),\"D\",\"-\"))","v":"-"},{"$f":"IF(NOT(ISBLANK(テーブル635[[#This Row],[ほ装]])),VLOOKUP(テーブル635[[#This Row],[ほ装]],ほ装[],2,TRUE), IF(NOT(ISBLANK(テーブル635[[#This Row],[許可区分(ほ装)]])),\"D\",\"-\"))","v":"-"},{"$f":"IF(NOT(ISBLANK(テーブル635[[#This Row],[塗装]])),VLOOKUP(テーブル635[[#This Row],[塗装]],塗装[],2,TRUE), IF(NOT(ISBLANK(テーブル635[[#This Row],[許可区分（塗装）]])),\"D\",\"-\"))","v":"-"},{"$f":"IF(NOT(ISBLANK(テーブル635[[#This Row],[防水]])),VLOOKUP(テーブル635[[#This Row],[防水]],塗装[],2,TRUE), IF(NOT(ISBLANK(テーブル635[[#This Row],[許可区分（防水）]])),\"D\",\"-\"))","v":"-"},{"$f":"IF(NOT(ISBLANK(テーブル635[[#This Row],[機械器具設置]])),VLOOKUP(テーブル635[[#This Row],[機械器具設置]],塗装[],2,TRUE), IF(NOT(ISBLANK(テーブル635[[#This Row],[許可区分（機械器具）]])),\"D\",\"-\"))","v":"-"},{"$f":"IF(NOT(ISBLANK(テーブル635[[#This Row],[電気通信]])),VLOOKUP(テーブル635[[#This Row],[電気通信]],電気[],2,TRUE), IF(NOT(ISBLANK(テーブル635[[#This Row],[許可区分(電気)]])),\"D\",\"-\"))","v":"C"},{"$f":"IF(NOT(ISBLANK(テーブル635[[#This Row],[水道施設]])),VLOOKUP(テーブル635[[#This Row],[水道施設]],水道[],2,TRUE), IF(NOT(ISBLANK(テーブル635[[#This Row],[許可区分（水道施設）]])),\"D\",\"-\"))","v":"-"}]
[30,"県外","ドリコ㈱","東京都中央区日本橋2-13-10","鮫島　修","03-6262-1421","03-6262-1431","特定",796,null,null,null,null,"特定",933,null,null,null,null,null,null,"特定",1107,null,null,"特定",1064,{"$f":"IF(NOT(ISBLANK(テーブル635[[#This Row],[土木一式]])),VLOOKUP(テーブル635[[#This Row],[土木一式]],土木[],2,TRUE), IF(NOT(ISBLANK(テーブル635[[#This Row],[許可区分(土木)]])),\"D\",\"-\"))","v":"A"},{"$f":"IF(NOT(ISBLANK(テーブル635[[#This Row],[建築一式]])),VLOOKUP(テーブル635[[#This Row],[建築一式]],建築[],2,TRUE), IF(NOT(ISBLANK(テーブル635[[#This Row],[許可区分（建築）]])),\"D\",\"-\"))","v":"-"},{"$f":"IF(NOT(ISBLANK(テーブル635[[#This Row],[電気]])),VLOOKUP(テーブル635[[#This Row],[電気]],電気[],2,TRUE), IF(NOT(ISBLANK(テーブル635[[#This Row],[許可区分（電気）]])),\"D\",\"-\"))","v":"-"},{"$f":"IF(NOT(ISBLANK(テーブル635[[#This Row],[管]])),VLOOKUP(テーブル635[[#This Row],[管]],管[],2,TRUE), IF(NOT(ISBLANK(テーブル635[[#This Row],[許可区分（管）]])),\"D\",\"-\"))","v":"A"},{"$f":"IF(NOT(ISBLANK(テーブル635[[#This Row],[ほ装]])),VLOOKUP(テーブル635[[#This Row],[ほ装]],ほ装[],2,TRUE), IF(NOT(ISBLANK(テーブル635[[#This Row],[許可区分(ほ装)]])),\"D\",\"-\"))","v":"-"},{"$f":"IF(NOT(ISBLANK(テーブル635[[#This Row],[塗装]])),VLOOKUP(テーブル635[[#This Row],[塗装]],塗装[],2,TRUE), IF(NOT(ISBLANK(テーブル635[[#This Row],[許可区分（塗装）]])),\"D\",\"-\"))","v":"-"},{"$f":"IF(NOT(ISBLANK(テーブル635[[#This Row],[防水]])),VLOOKUP(テーブル635[[#This Row],[防水]],塗装[],2,TRUE), IF(NOT(ISBLANK(テーブル635[[#This Row],[許可区分（防水）]])),\"D\",\"-\"))","v":"-"},{"$f":"IF(NOT(ISBLANK(テーブル635[[#This Row],[機械器具設置]])),VLOOKUP(テーブル635[[#This Row],[機械器具設置]],塗装[],2,TRUE), IF(NOT(ISBLANK(テーブル635[[#This Row],[許可区分（機械器具）]])),\"D\",\"-\"))","v":"A"},{"$f":"IF(NOT(ISBLANK(テーブル635[[#This Row],[電気通信]])),VLOOKUP(テーブル635[[#This Row],[電気通信]],電気[],2,TRUE), IF(NOT(ISBLANK(テーブル635[[#This Row],[許可区分(電気)]])),\"D\",\"-\"))","v":"-"},{"$f":"IF(NOT(ISBLANK(テーブル635[[#This Row],[水道施設]])),VLOOKUP(テーブル635[[#This Row],[水道施設]],水道[],2,TRUE), IF(NOT(ISBLANK(テーブル635[[#This Row],[許可区分（水道施設）]])),\"D\",\"-\"))","v":"A"}]
[31,"県外","大成機工㈱　東京支店","東京都中央区日本橋1-2-5","中村　稔","03-5201-7771","03-5201-7700","特定",987,null,null,null,null,"特定",1141,null,null,"特定",937,"特定",908,"特定",1108,null,null,"特定",1300,{"$f":"IF(NOT(ISBLANK(テーブル635[[#This Row],[土木一式]])),VLOOKUP(テーブル635[[#This Row],[土木一式]],土木[],2,TRUE), IF(NOT(ISBLANK(テーブル635[[#This Row],[許可区分(土木)]])),\"D\",\"-\"))","v":"A"},{"$f":"IF(NOT(ISBLANK(テーブル635[[#This Row],[建築一式]])),VLOOKUP(テーブル635[[#This Row],[建築一式]],建築[],2,TRUE), IF(NOT(ISBLANK(テーブル635[[#This Row],[許可区分（建築）]])),\"D\",\"-\"))","v":"-"},{"$f":"IF(NOT(ISBLANK(テーブル635[[#This Row],[電気]])),VLOOKUP(テーブル635[[#This Row],[電気]],電気[],2,TRUE), IF(NOT(ISBLANK(テーブル635[[#This Row],[許可区分（電気）]])),\"D\",\"-\"))","v":"-"},{"$f":"IF(NOT(ISBLANK(テーブル635[[#This Row],[管]])),VLOOKUP(テーブル635[[#This Row],[管]],管[],2,TRUE), IF(NOT(ISBLANK(テーブル635[[#This Row],[許可区分（管）]])),\"D\",\"-\"))","v":"A"},{"$f":"IF(NOT(ISBLANK(テーブル635[[#This Row],[ほ装]])),VLOOKUP(テーブル635[[#This Row],[ほ装]],ほ装[],2,TRUE), IF(NOT(ISBLANK(テーブル635[[#This Row],[許可区分(ほ装)]])),\"D\",\"-\"))","v":"-"},{"$f":"IF(NOT(ISBLANK(テーブル635[[#This Row],[塗装]])),VLOOKUP(テーブル635[[#This Row],[塗装]],塗装[],2,TRUE), IF(NOT(ISBLANK(テーブル635[[#This Row],[許可区分（塗装）]])),\"D\",\"-\"))","v":"A"},{"$f":"IF(NOT(ISBLANK(テーブル635[[#This Row],[防水]])),VLOOKUP(テーブル635[[#This Row],[防水]],塗装[],2,TRUE), IF(NOT(ISBLANK(テーブル635[[#This Row],[許可区分（防水）]])),\"D\",\"-\"))","v":"A"},{"$f":"IF(NOT(ISBLANK(テーブル635[[#This Row],[機械器具設置]])),VLOOKUP(テーブル635[[#This Row],[機械器具設置]],塗装[],2,TRUE), IF(NOT(ISBLANK(テーブル635[[#This Row],[許可区分（機械器具）]])),\"D\",\"-\"))","v":"A"},{"$f":"IF(NOT(ISBLANK(テーブル635[[#This Row],[電気通信]])),VLOOKUP(テーブル635[[#This Row],[電気通信]],電気[],2,TRUE), IF(NOT(ISBLANK(テーブル635[[#This Row],[許可区分(電気)]])),\"D\",\"-\"))","v":"-"},{"$f":"IF(NOT(ISBLANK(テーブル635[[#This Row],[水道施設]])),VLOOKUP(テーブル635[[#This Row],[水道施設]],水道[],2,TRUE), IF(NOT(ISBLANK(テーブル635[[#This Row],[許可区分（水道施設）]])),\"D\",\"-\"))","v":"A"}]
[32,"県外","㈱竹中土木　東京本店","東京都江東区新砂1-1-1","小幡　伊三美","03-6810-6219","03-6660-6306","特定",1805,null,null,null,null,null,null,"特定",1236,null,null,null,null,null,null,null,null,"特定",1245,{"$f":"IF(NOT(ISBLANK(テーブル635[[#This Row],[土木一式]])),VLOOKUP(テーブル635[[#This Row],[土木一式]],土木[],2,TRUE), IF(NOT(ISBLANK(テーブル635[[#This Row],[許可区分(土木)]])),\"D\",\"-\"))","v":"A"},{"$f":"IF(NOT(ISBLANK(テーブル635[[#This Row],[建築一式]])),VLOOKUP(テーブル635[[#This Row],[建築一式]],建築[],2,TRUE), IF(NOT(ISBLANK(テーブル635[[#This Row],[許可区分（建築）]])),\"D\",\"-\"))","v":"-"},{"$f":"IF(NOT(ISBLANK(テーブル635[[#This Row],[電気]])),VLOOKUP(テーブル635[[#This Row],[電気]],電気[],2,TRUE), IF(NOT(ISBLANK(テーブル635[[#This Row],[許可区分（電気）]])),\"D\",\"-\"))","v":"-"},{"$f":"IF(NOT(ISBLANK(テーブル635[[#This Row],[管]])),VLOOKUP(テーブル635[[#This Row],[管]],管[],2,TRUE), IF(NOT(ISBLANK(テーブル635[[#This Row],[許可区分（管）]])),\"D\",\"-\"))","v":"-"},{"$f":"IF(NOT(ISBLANK(テーブル635[[#This Row],[ほ装]])),VLOOKUP(テーブル635[[#This Row],[ほ装]],ほ装[],2,TRUE), IF(NOT(ISBLANK(テーブル635[[#This Row],[許可区分(ほ装)]])),\"D\",\"-\"))","v":"A"},{"$f":"IF(NOT(ISBLANK(テーブル635[[#This Row],[塗装]])),VLOOKUP(テーブル635[[#This Row],[塗装]],塗装[],2,TRUE), IF(NOT(ISBLANK(テーブル635[[#This Row],[許可区分（塗装）]])),\"D\",\"-\"))","v":"-"},{"$f":"IF(NOT(ISBLANK(テーブル635[[#This Row],[防水]])),VLOOKUP(テーブル635[[#This Row],[防水]],塗装[],2,TRUE), IF(NOT(ISBLANK(テーブル635[[#This Row],[許可区分（防水）]])),\"D\",\"-\"))","v":"-"},{"$f":"IF(NOT(ISBLANK(テーブル635[[#This Row],[機械器具設置]])),VLOOKUP(テーブル635[[#This Row],[機械器具設置]],塗装[],2,TRUE), IF(NOT(ISBLANK(テーブル635[[#This Row],[許可区分（機械器具）]])),\"D\",\"-\"))","v":"-"},{"$f":"IF(NOT(ISBLANK(テーブル635[[#This Row],[電気通信]])),VLOOKUP(テーブル635[[#This Row],[電気通信]],電気[],2,TRUE), IF(NOT(ISBLANK(テーブル635[[#This Row],[許可区分(電気)]])),\"D\",\"-\"))","v":"-"},{"$f":"IF(NOT(ISBLANK(テーブル635[[#This Row],[水道施設]])),VLOOKUP(テーブル635[[#This Row],[水道施設]],水道[],2,TRUE), IF(NOT(ISBLANK(テーブル635[[#This Row],[許可区分（水道施設）]])),\"D\",\"-\"))","v":"A"}]
[33,"県外","水ingエンジニアリング㈱　首都圏支店","東京都港区港南1丁目7番18号","川俣　幸夫","03-6830-9090","03-5479-8520","特定",846,null,null,"特定",965,"特定",925,null,null,"特定",831,null,null,"特定",1227,null,null,"特定",1263,{"$f":"IF(NOT(ISBLANK(テーブル635[[#This Row],[土木一式]])),VLOOKUP(テーブル635[[#This Row],[土木一式]],土木[],2,TRUE), IF(NOT(ISBLANK(テーブル635[[#This Row],[許可区分(土木)]])),\"D\",\"-\"))","v":"A"},{"$f":"IF(NOT(ISBLANK(テーブル635[[#This Row],[建築一式]])),VLOOKUP(テーブル635[[#This Row],[建築一式]],建築[],2,TRUE), IF(NOT(ISBLANK(テーブル635[[#This Row],[許可区分（建築）]])),\"D\",\"-\"))","v":"-"},{"$f":"IF(NOT(ISBLANK(テーブル635[[#This Row],[電気]])),VLOOKUP(テーブル635[[#This Row],[電気]],電気[],2,TRUE), IF(NOT(ISBLANK(テーブル635[[#This Row],[許可区分（電気）]])),\"D\",\"-\"))","v":"A"},{"$f":"IF(NOT(ISBLANK(テーブル635[[#This Row],[管]])),VLOOKUP(テーブル635[[#This Row],[管]],管[],2,TRUE), IF(NOT(ISBLANK(テーブル635[[#This Row],[許可区分（管）]])),\"D\",\"-\"))","v":"A"},{"$f":"IF(NOT(ISBLANK(テーブル635[[#This Row],[ほ装]])),VLOOKUP(テーブル635[[#This Row],[ほ装]],ほ装[],2,TRUE), IF(NOT(ISBLANK(テーブル635[[#This Row],[許可区分(ほ装)]])),\"D\",\"-\"))","v":"-"},{"$f":"IF(NOT(ISBLANK(テーブル635[[#This Row],[塗装]])),VLOOKUP(テーブル635[[#This Row],[塗装]],塗装[],2,TRUE), IF(NOT(ISBLANK(テーブル635[[#This Row],[許可区分（塗装）]])),\"D\",\"-\"))","v":"A"},{"$f":"IF(NOT(ISBLANK(テーブル635[[#This Row],[防水]])),VLOOKUP(テーブル635[[#This Row],[防水]],塗装[],2,TRUE), IF(NOT(ISBLANK(テーブル635[[#This Row],[許可区分（防水）]])),\"D\",\"-\"))","v":"-"},{"$f":"IF(NOT(ISBLANK(テーブル635[[#This Row],[機械器具設置]])),VLOOKUP(テーブル635[[#This Row],[機械器具設置]],塗装[],2,TRUE), IF(NOT(ISBLANK(テーブル635[[#This Row],[許可区分（機械器具）]])),\"D\",\"-\"))","v":"A"},{"$f":"IF(NOT(ISBLANK(テーブル635[[#This Row],[電気通信]])),VLOOKUP(テーブル635[[#This Row],[電気通信]],電気[],2,TRUE), IF(NOT(ISBLANK(テーブル635[[#This Row],[許可区分(電気)]])),\"D\",\"-\"))","v":"-"},{"$f":"IF(NOT(ISBLANK(テーブル635[[#This Row],[水道施設]])),VLOOKUP(テーブル635[[#This Row],[水道施設]],水道[],2,TRUE), IF(NOT(ISBLANK(テーブル635[[#This Row],[許可区分（水道施設）]])),\"D\",\"-\"))","v":"A"}]

{"sheet":"等級(19-4月現在)","index":3,"n_rows":20,"n_cols":8,"rows_kept":20,"cut":false,"hidden":false,"merged":[]}
["列1","土木一式",null,"列1","建築一式",null,"列1","電気"]
[0,"-",null,0,"-",null,0,"-"]
[1,"D",null,1,"D",null,1,"D"]
[550,"C",null,600,"C",null,600,"C"]
[650,"B",null,700,"B",null,700,"B"]
[750,"A",null,800,"A",null,800,"A"]
[]
["列1","管",null,"列1","塗装",null,"列1","水道"]
[0,"-",null,0,"-",null,0,"-"]
[1,"D",null,1,"D",null,1,"D"]
[500,"C",null,600,"C",null,600,"C"]
[600,"B",null,700,"B",null,700,"B"]
[700,"A",null,800,"A",null,800,"A"]
[]
["列1","ほ装"]
[0,"-"]
[1,"D"]
[500,"C"]
[600,"B"]
[700,"A"]